{"text_format":"3","workbook":"xlsx","n_sheets":12,"sheets":[" ","Anleitung","Futterwerte","Eigenmischungen","Ration Milch","Ration Milch-Mineralstoffe","Zuteilung-Milchleistungsfutter","Modul1","TMR-Mischplan","Ration Aufzucht-Mast","Info","Einstellungen"],"not_rendered":{"charts":12,"images":5,"external_links":1,"defined_names":173,"comments":4},"read":"whole","date_system":"1900"}

{"sheet":" ","index":0,"n_rows":8,"n_cols":2,"rows_kept":8}
[]
[]
[]
[null,"UniRat 2022"]
[]
[null,"Rationsberechnung für "]
[null,"Milchvieh, Aufzuchtrinder, Mastbullen"]
[null,"Milchziegen, Milchschafe"]

{"sheet":"Anleitung","index":1,"n_rows":22,"n_cols":6,"rows_kept":22,"merged":[[3,1,3,5],[6,1,6,5]]}
[]
[null,"Futterrationsplanung mit dem \"Uni_Rat\"-Programm "]
[]
[null,"\"Uni-Rat\" ist ein einfach zu bedienendes, auf der Basis der Tabellenkalkulation MS-Excel programmiertes Rationsberechnungsprogramm für Rinder, Schafe und Ziegen.\nDas Programm umfasst Möglichkeiten der Berechnung von Einzelkomponentenrationen, aufgewerteten Trogrationen (TR) in Kombination mit einer Abruffütterung bis hin zur Totalen Mischration (TMR). Ergänzend können Kraftfutterlisten und Mischpläne erstellt werden. \n\"Uni-Rat\" ist mit seiner Nutzerführung und den eingebundenen Darstellungen für den schulischen Einsatz in der landwirtschaftlichen Aus- und Fortbildung konzipiert."]
[]
[null,"Bedienung"]
[null,"Nachfolgend werden die einzelnen Arbeitsblätter und deren Verknüpfung untereinander dargestellt."]
[]
[null,"Arbeitsblatt",null,"Funktion",null,"Verknüpfungen (Datenübergabe)"]
[null,"Futterwerte",null,"Das Arbeitsblatt \"Futterwerte\" bietet die Möglichkeit auf tabellierte Futterwerte zurückzugreifen, betriebseigene Futtermittel anzulegen und eigene Futterwertananlysen aufzunehmen. Von allen Kalkulationsseiten wird auf diese Werte zurückgegriffen. Eigenmischungen der Seiten \"Eigenmischungen\" und \"TMR Mischplan\" werden an die Stelle übernommen und stehen so für die weitere Rationsplanung zur Verfügung (Vorsicht! Keine Weiterverwendung auf der Ursprungsseite möglich!).\nBeim Anlegen eigener Futtermittel können die Daten vorhandener Futtermittel kopiert werden. Hierdurch lassen sich Datenlücken, die zu Fehlern in den Berechnungen führen können, vermieden.  ",null,"Auf den Seiten \"Eigenmischungen\" und \"TMR Mischplan\" berechnete Daten werden übernommen.\nEine Datenübergabe findet zu den Arbeitsblättern \"Eigenmischungen\", \"Ration Milch\", \"Ration Milch - Mineralstoffe\", \"Zuteilung-Milchleistungsfutter\", \"TMR-Mischplan\" und \"Ration Aufzucht-Mast\" statt."]
[]
[null,"Eigenmischungen",null,"Die Eingabemaske \"Eigenmischung\" erlaubt es, betriebseigene Mischungen zu erstellen und zugekaufte Mischfutter anhand einer offenen Deklaration zu kalkulieren. Die benötigten Komponenten werden aus dem Datenbestand der \"Futterwerte\" ausgewählt. Eine Plausibilitätsprüfung kontrolliert die Vollständigkeit der Mischung. Energiestufe und Nährstoffgehalte werden in einer Übersicht zusammengefasst. Die Seite kann als Mischanweisung ausgedruckt werden.",null,"Die Nährstoffgehalte werden aus der Eingabemaske \"Futterwerte\" übernommen.\nDie berechneten Daten werden an \"Futterwerte\" übergeben."]
[]
[null,"Ration Milch",null,"Im Arbeitsblatt \"Ration Milch\" können einfache Futterrationen berechnet werden.\nDer Rationsberechnung liegt ein dreistufiger Aufbau aus Grobfutter, Rationsausgleich und Milchleistungsfutter zugrunde.\nAls Tierarten können Milchkühe, Milchschafe oder Milchziegen ausgewählt werden. \nDie Dateneingabe kann nach Auswahl entweder in Frischmasse oder als Trockenmasse erfolgen. Die Berechnungen erfolgen dabei grundsätzlich auf der Basis der Trockenmasse. \nZur Vorhersage der Futteraufnahme ist es notwendig, Fütterungssystem (TMR oder Einzelkomponenten), die Rasse, die Latation und das Laktationsstadium einzugeben.\nGewicht, Milchleistung, sowie Milchinhaltsstoffe dienen der Bedarfsermittlung. Bei Trockensteherrationen ist hier der Buchstabe T einzugeben um den Leistungsbedarf abzubilden.\nDie Auswahl der Futtermittel erfolgt über Auswahlfelder. Sofern betriebsspezifische Futterwerte angenommen werden sollen, sind die Futtermittel in der Futterwerttabelle \"Futterwerte\"  anzulegen. Die entsprechenden Mengen werden in der 1. Spalte eingegeben.\nNach erfolgter Eingabe werden die Rationskennzahlen als Summe und je kg Trockenmasse ausgewiesen. Die theoretische Futteraufnahme wird der eingegebenen gegenüber gestellt. \nDie Mineralstoffversorgung wird als Bilanz dargestellt.\nEine Ampelfunktion zeigt die Plausibilität, bzw. Zulässigkeit wesentlicher Kennzahlen an. Lückenhafte Datensätze werden gekennzeichnet. Die Daten sind hier auf Plausibilität zu prüfen, evtl. fehlende Daten sind in der Futterwerttabelle \"Futterwerte\" zu ergänzen. \nÜber die Gliederungsfunktion (+) lassen sich weitere Kennzahlen der Futterration ein- bzw. ausblenden.\nDie ermittelten Ergebnisse lassen sich als festgelegter Druckbereich ausdrucken.",null,"Die Nährstoffgehalte werden aus der Eingabemaske \"Futterwerte\" übernommen.\nDie Daten aus Grobfutter und Rationsausgleich werden an die Maske \"Zuteilung-Milchleistungsfutter\" weitergegeben.\nDie Futtermengen der Seite \"Ration Milch-Mineralstoffe\" basieren auf den auf Arbeitsblatt \"Ration Milch\" gemachten Angaben.\nDie Toleranzbereiche der Rationskennzahlen können auf der Seite \"Einstellungen\" angepasst werden."]
[]
[null,"Ration Milch-Mineralstoffe",null,"Im Arbeitsblatt \"Ration Milch - Mineralstoffe\" erfolgt die Bilanzierung der Mineralstoffgehalte. Die im Arbeitsblatt \"Ration Milch\" ausgewählten Futtermittel und die in der Futterwerttabelle \"Futterwerte\" gemachten Angaben werden übernommen. \nUnvollständige Datensätze werden markiert und sind ggf. auf der Seite \"Futterwerte\" zu vervollständigen.",null,"Die Ergebnisse werden zur Seite \"Ration Milch\" übergeben.\nMineralstoffgehalte werden aus dem Arbeitsblatt \"Futterwerte\" übernommen."]
[]
[null,"Zuteilung Milchleistungsfutter",null,"Das Arbeitsblatt \"Zuteilung Milchleistungsfutter\" dient der Erstellung einer Kraftfutterliste als Grundlage der tierindividuellen Kraftfutterzuteilung. \nDie Kalkulation erfolgt auf der Basis der in \"Ration Milch\" angelegten Ration aus Grobfutter und Rationsausgleich. Wird mit einem Futtermischwagen nach dem Konzept der Aufgewerteten Mischration gearbeitet, so ist diese auf der Seite \"Ration Milch\" anzulegen. Ergänzend hierzu werden im Spaltenkopf ergänzende Angaben zum Kraftfuttereinsatz gemacht.\nEs kann mit zwei verschiedenen Leistungsfuttern gearbeitet werden. Das ausgewählte Ausgleichkraftfutter wird ab der festgelegten Leistungsuntergrenze fix zugeteilt. \nEin zweites ausgewähltes Leistungsfutter wird je nach Milchleistung und zu erwartenden Futteraufnahme automatisch zugeteilt. Bei Nutzung eines AMS kann die Lockfuttergabe als Minimalmenge vorgegeben werden. Es besteht darüber hinaus die Möglichkeit das das automatisch zugeteilte Milchleistungsfutter als Rationsanteil zu begrenzen.\nEinflüsse von Managementniveau, Haltungs- und klimatischen Bedingungen können über die Korrektur der Tm-Aufnahme berücksichtigt werden. \nÜber die Gliederungsfunktion (+) lassen sich weitere Kennzahlen der Futterration ein- bzw. ausblenden.\nDie ermittelten Ergebnisse lassen sich als festgelegter Druckbereich ausdrucken.",null,"Die Kennzahlen zur Trogration basieren auf den Seiten \"Ration Milch\" und \"Ration Milch - Mineralstoffe\". Die Futterwerte Die ausgewählten Leistungsfutter werden aus der \"Futterwerttabelle\" übernommen.Die Markierung kritischer Werte erfolgt auf Basis der \"Einstellungen\"."]
[]
[null,"TMR-Mischplan",null,"Die Seite \"TMR-Mischplan\" dient der Erstellung von Mischplänen. Nach Auswahl der benötigten betriebseigenen und zugekauften Komponenten werden die Rationsanteile eingegeben. Nach Festlegung  \"TM/FM\" im Rationskopf können die Mengen sowohl in Frischmasse als auch in  Trockenmasse eingegeben werden. Mischplan und Nährstoffübersicht können ausgedruckt werden. Die freigehaltenen Bereiche \"peNDF\" dienen dem Eintrag von Siebungsergebnissen (Schüttelbox).",null,"Grundlage der Berechnungen ist die Tabelle \"Futterwerte\".\nDie Ergebnisse werden an \"Futterwerte\" übergeben."]
[]
[null,"Ration Aufzucht-Mast",null,"Das Arbeitsblatt \"Ration Aufzucht-Mast\" bietet die Möglichkeit Rationen für Aufzuchtrinder und Mastbullen zu berechnen. \nNach Auswahl der in \"Futterwerte\" hinterlegten Futtermittel können deren Mengen für den zuvor festgelegten Gewichtsabschnitt eingegeben werden. Hierbei können variable und fixe Komponenten festgelegt werden.\nNeben den Kennzahlen für den ausgewählten Gewichtsbereich werden zu erwartende Futteraufnahme und Tageszunahmen für abweichende Lebendmassebereiche dargestellt. Die Proteinversorgung wird visualisiert.\n",null,"Die Übernahme der Nährstoffgehalte erfolgt von der Seite \"Futterwerte\". \nDie Bedarfswerte sind aus verschiedenen Quellen (GfE, Gruber) abgeleitet und auf der Seite \"Info\" dargestellt."]

{"sheet":"Futterwerte","index":2,"n_rows":268,"n_cols":34,"rows_kept":268,"merged":[[2,10,2,11],[2,19,2,23],[3,10,3,11],[6,19,6,23]]}
[null,"Futterwerttabelle"]
[]
[null,"Futtermittel","Trocken-","Netto-","Umsetzb.","Roh-",null,"nutzb.","rum. ","Struktur-","Faser",null,"Nicht-","Stärke","Zucker","Rohfett","Rohfaser",null," ","Mineralstoffe"]
[null,null,"substanz","Energie-","Energie","protein",null,"Roh-","N-","wert","kohlenhydrate",null,"FaserKH"]
[{"$nulls":3},"Laktation",{"$nulls":3},"protein","Bilanz"]
[null,null,"TS","NEL","ME","XP","UDP","nXP","RNB","SW","ADF","NDF","NFC","XS","XZ","XL","XF","sXF","XA","Ca","P","Na","Mg","K","Se","DCAB","Kosten",null,"XF","XS","Beständigkeit XS","bXS","XZ","a"]
[null,null,"g/kg FM","MJ/kg TM","MJ/kg TM","g / kg TM",{"$nulls":12},"g/TM","g / kg TM",{"$nulls":4},"mg/kg TM","meq/kg TM","€/dt FM"]
["Eigene Analysen",null,1E-3,0,0,0,0,0,0,0,0,0,0,0,null,null,0,0,0,0,0,0,0,0]
{"$rows_empty":21}
[{"$nulls":27},{"$f":"IF(COUNTA(B30:Y30)<21,\"x\",\"\")","v":"x"}]
[]
[{"$nulls":27},{"$f":"IF(COUNTA(B32:Y32)<21,\"x\",\"\")","v":"x"}]
[]
["Eigenmischungen"]
[null,{"$f":"Eigenmischungen!AC2","v":"Mischung ..."},{"$f":"ROUND(Eigenmischungen!AC27*10,-1)","v":0},{"$f":"ROUND(Eigenmischungen!AC28,1)","v":{"v":0,"d":"0.0"}},{"$f":"ROUND(Eigenmischungen!AC29,1)","v":{"v":0,"d":"0.0"}},{"$f":"ROUND(Eigenmischungen!AC30,0)","v":0},{"$f":"ROUND(Eigenmischungen!AC31,2)","v":{"v":0,"d":"0%"}},{"$f":"ROUND(Eigenmischungen!AC32,0)","v":0},{"$f":"ROUND(Eigenmischungen!AC33,1)","v":{"v":0,"d":"0.0"}},{"$f":"ROUND(Eigenmischungen!AC34,1)","v":{"v":0,"d":"0.0"}},{"$f":"ROUND(Eigenmischungen!AC35,0)","v":0},{"$f":"ROUND(Eigenmischungen!AC36,0)","v":0},{"$f":"ROUND(Eigenmischungen!AC37,0)","v":0},{"$f":"ROUND(Eigenmischungen!AC38,0)","v":0},{"$f":"ROUND(Eigenmischungen!AC39,0)","v":0},{"$f":"ROUND(Eigenmischungen!AC40,0)","v":0},{"$f":"ROUND(Eigenmischungen!AC41,0)","v":0},{"$f":"ROUND(Eigenmischungen!AC42,2)","v":{"v":0,"d":"0%"}},{"$f":"ROUND(Eigenmischungen!AC43,0)","v":0},{"$f":"ROUND(Eigenmischungen!AC44,1)","v":{"v":0,"d":"0.0"}},{"$f":"ROUND(Eigenmischungen!AC45,1)","v":{"v":0,"d":"0.0"}},{"$f":"ROUND(Eigenmischungen!AC46,1)","v":{"v":0,"d":"0.0"}},{"$f":"ROUND(Eigenmischungen!AC47,1)","v":{"v":0,"d":"0.0"}},{"$f":"ROUND(Eigenmischungen!AC48,1)","v":{"v":0,"d":"0.0"}},{"$f":"ROUND(Eigenmischungen!AC49,1)","v":{"v":0,"d":"0.0"}},{"$f":"ROUND(Eigenmischungen!AC50,1)","v":{"v":0,"d":"0.0"}},{"$f":"ROUND(Eigenmischungen!AC26,1)","v":{"v":0,"d":"0.0"}},{"$f":"ROUND(Eigenmischungen!AF47,1)","v":{"v":0,"d":"0.0"}},{"$f":"ROUND(Eigenmischungen!AG47,1)","v":{"v":0,"d":"0.0"}},{"$f":"ROUND(Eigenmischungen!AH47,1)","v":{"v":0,"d":"0.0"}},{"$f":"ROUND(Eigenmischungen!AI47,1)","v":{"v":0,"d":"0.0"}},{"$f":"ROUND(Eigenmischungen!AJ47,1)","v":{"v":0,"d":"0.0"}},{"$f":"ROUND(Eigenmischungen!AK47,1)","v":{"v":0,"d":"0.0"}},{"$f":"ROUND(Eigenmischungen!AL47,1)","v":{"v":0,"d":"0.0"}}]
[null,{"$f":"Eigenmischungen!AD2","v":"Mischung ..."},{"$f":"ROUND(Eigenmischungen!AD27*10,-1)","v":0},{"$f":"ROUND(Eigenmischungen!AD28,1)","v":{"v":0,"d":"0.0"}},{"$f":"ROUND(Eigenmischungen!AD29,1)","v":{"v":0,"d":"0.0"}},{"$f":"ROUND(Eigenmischungen!AD30,0)","v":0},{"$f":"ROUND(Eigenmischungen!AD31,2)","v":{"v":0,"d":"0%"}},{"$f":"ROUND(Eigenmischungen!AD32,0)","v":0},{"$f":"ROUND(Eigenmischungen!AD33,1)","v":{"v":0,"d":"0.0"}},{"v":-0.01,"d":"-0.0"},{"$f":"ROUND(Eigenmischungen!AD35,0)","v":0},{"$f":"ROUND(Eigenmischungen!AD36,0)","v":0},{"$f":"ROUND(Eigenmischungen!AD37,0)","v":0},{"$f":"ROUND(Eigenmischungen!AD38,0)","v":0},{"$f":"ROUND(Eigenmischungen!AD39,0)","v":0},{"$f":"ROUND(Eigenmischungen!AD40,0)","v":0},{"$f":"ROUND(Eigenmischungen!AD41,0)","v":0},{"$f":"ROUND(Eigenmischungen!AD42,2)","v":{"v":0,"d":"0%"}},{"$f":"ROUND(Eigenmischungen!AD43,0)","v":0},{"$f":"ROUND(Eigenmischungen!AD44,1)","v":{"v":0,"d":"0.0"}},{"$f":"ROUND(Eigenmischungen!AD45,1)","v":{"v":0,"d":"0.0"}},{"$f":"ROUND(Eigenmischungen!AD46,1)","v":{"v":0,"d":"0.0"}},{"$f":"ROUND(Eigenmischungen!AD47,1)","v":{"v":0,"d":"0.0"}},{"$f":"ROUND(Eigenmischungen!AD48,1)","v":{"v":0,"d":"0.0"}},{"$f":"ROUND(Eigenmischungen!AD49,1)","v":{"v":0,"d":"0.0"}},{"$f":"ROUND(Eigenmischungen!AE50,1)","v":{"v":0,"d":"0.0"}},{"$f":"ROUND(Eigenmischungen!AD26,1)","v":{"v":0,"d":"0.0"}},{"$f":"ROUND(Eigenmischungen!AG47,1)","v":{"v":0,"d":"0.0"}},{"$f":"ROUND(Eigenmischungen!AH47,1)","v":{"v":0,"d":"0.0"}},{"$f":"ROUND(Eigenmischungen!AI47,1)","v":{"v":0,"d":"0.0"}},{"$f":"ROUND(Eigenmischungen!AJ47,1)","v":{"v":0,"d":"0.0"}},{"$f":"ROUND(Eigenmischungen!AK47,1)","v":{"v":0,"d":"0.0"}},{"$f":"ROUND(Eigenmischungen!AL47,1)","v":{"v":0,"d":"0.0"}},{"$f":"ROUND(Eigenmischungen!AM47,1)","v":{"v":0,"d":"0.0"}}]
[null,{"$f":"Eigenmischungen!AE2","v":"Mischung ..."},{"$f":"ROUND(Eigenmischungen!AE27*10,-1)","v":0},{"$f":"ROUND(Eigenmischungen!AE28,1)","v":{"v":0,"d":"0.0"}},{"$f":"ROUND(Eigenmischungen!AE29,1)","v":{"v":0,"d":"0.0"}},{"$f":"ROUND(Eigenmischungen!AE30,0)","v":0},{"$f":"ROUND(Eigenmischungen!AE31,2)","v":{"v":0,"d":"0%"}},{"$f":"ROUND(Eigenmischungen!AE32,0)","v":0},{"$f":"ROUND(Eigenmischungen!AE33,1)","v":{"v":0,"d":"0.0"}},{"$f":"ROUND(Eigenmischungen!AE34,1)","v":{"v":0,"d":"0.0"}},{"$f":"ROUND(Eigenmischungen!AE35,0)","v":0},{"$f":"ROUND(Eigenmischungen!AE36,0)","v":0},{"$f":"ROUND(Eigenmischungen!AE37,0)","v":0},{"$f":"ROUND(Eigenmischungen!AE38,0)","v":0},{"$f":"ROUND(Eigenmischungen!AE39,0)","v":0},{"$f":"ROUND(Eigenmischungen!AE40,0)","v":0},{"$f":"ROUND(Eigenmischungen!AE41,0)","v":0},{"$f":"ROUND(Eigenmischungen!AE42,2)","v":{"v":0,"d":"0%"}},{"$f":"ROUND(Eigenmischungen!AE43,0)","v":0},{"$f":"ROUND(Eigenmischungen!AE44,1)","v":{"v":0,"d":"0.0"}},{"$f":"ROUND(Eigenmischungen!AE45,1)","v":{"v":0,"d":"0.0"}},{"$f":"ROUND(Eigenmischungen!AE46,1)","v":{"v":0,"d":"0.0"}},{"$f":"ROUND(Eigenmischungen!AE47,1)","v":{"v":0,"d":"0.0"}},{"$f":"ROUND(Eigenmischungen!AE48,1)","v":{"v":0,"d":"0.0"}},{"$f":"ROUND(Eigenmischungen!AE49,1)","v":{"v":0,"d":"0.0"}},{"$f":"ROUND(Eigenmischungen!AF50,1)","v":{"v":0,"d":"0.0"}},{"$f":"ROUND(Eigenmischungen!AE26,1)","v":{"v":0,"d":"0.0"}},{"$f":"ROUND(Eigenmischungen!AH47,1)","v":{"v":0,"d":"0.0"}},{"$f":"ROUND(Eigenmischungen!AI47,1)","v":{"v":0,"d":"0.0"}},{"$f":"ROUND(Eigenmischungen!AJ47,1)","v":{"v":0,"d":"0.0"}},{"$f":"ROUND(Eigenmischungen!AK47,1)","v":{"v":0,"d":"0.0"}},{"$f":"ROUND(Eigenmischungen!AL47,1)","v":{"v":0,"d":"0.0"}},{"$f":"ROUND(Eigenmischungen!AM47,1)","v":{"v":0,"d":"0.0"}},{"$f":"ROUND(Eigenmischungen!AN47,1)","v":{"v":0,"d":"0.0"}}]
[null,{"$f":"Eigenmischungen!AF2","v":"Mischung ..."},{"$f":"ROUND(Eigenmischungen!AF27*10,-1)","v":0},{"$f":"ROUND(Eigenmischungen!AF28,1)","v":{"v":0,"d":"0.0"}},{"$f":"ROUND(Eigenmischungen!AF29,1)","v":{"v":0,"d":"0.0"}},{"$f":"ROUND(Eigenmischungen!AF30,0)","v":0},{"$f":"ROUND(Eigenmischungen!AF31,2)","v":{"v":0,"d":"0%"}},{"$f":"ROUND(Eigenmischungen!AF32,0)","v":0},{"$f":"ROUND(Eigenmischungen!AF33,1)","v":{"v":0,"d":"0.0"}},{"$f":"ROUND(Eigenmischungen!AF34,1)","v":{"v":0,"d":"0.0"}},{"$f":"ROUND(Eigenmischungen!AF35,0)","v":0},{"$f":"ROUND(Eigenmischungen!AF36,0)","v":0},{"$f":"ROUND(Eigenmischungen!AF37,0)","v":0},{"$f":"ROUND(Eigenmischungen!AF38,0)","v":0},{"$f":"ROUND(Eigenmischungen!AF39,0)","v":0},{"$f":"ROUND(Eigenmischungen!AF40,0)","v":0},{"$f":"ROUND(Eigenmischungen!AF41,0)","v":0},{"$f":"ROUND(Eigenmischungen!AF42,2)","v":{"v":0,"d":"0%"}},{"$f":"ROUND(Eigenmischungen!AF43,0)","v":0},{"$f":"ROUND(Eigenmischungen!AF44,1)","v":{"v":0,"d":"0.0"}},{"$f":"ROUND(Eigenmischungen!AF45,1)","v":{"v":0,"d":"0.0"}},{"$f":"ROUND(Eigenmischungen!AF46,1)","v":{"v":0,"d":"0.0"}},{"$f":"ROUND(Eigenmischungen!AF47,1)","v":{"v":0,"d":"0.0"}},{"$f":"ROUND(Eigenmischungen!AF48,1)","v":{"v":0,"d":"0.0"}},{"$f":"ROUND(Eigenmischungen!AF49,1)","v":{"v":0,"d":"0.0"}},{"$f":"ROUND(Eigenmischungen!AG50,1)","v":{"v":0,"d":"0.0"}},{"$f":"ROUND(Eigenmischungen!AF26,1)","v":{"v":0,"d":"0.0"}},{"$f":"ROUND(Eigenmischungen!AI47,1)","v":{"v":0,"d":"0.0"}},{"$f":"ROUND(Eigenmischungen!AJ47,1)","v":{"v":0,"d":"0.0"}},{"$f":"ROUND(Eigenmischungen!AK47,1)","v":{"v":0,"d":"0.0"}},{"$f":"ROUND(Eigenmischungen!AL47,1)","v":{"v":0,"d":"0.0"}},{"$f":"ROUND(Eigenmischungen!AM47,1)","v":{"v":0,"d":"0.0"}},{"$f":"ROUND(Eigenmischungen!AN47,1)","v":{"v":0,"d":"0.0"}},{"$f":"ROUND(Eigenmischungen!AO47,1)","v":{"v":0,"d":"0.0"}}]
[null,{"$f":"Eigenmischungen!AG2","v":"Mischung ..."},{"$f":"ROUND(Eigenmischungen!AG27*10,-1)","v":0},{"$f":"ROUND(Eigenmischungen!AG28,1)","v":{"v":0,"d":"0.0"}},{"$f":"ROUND(Eigenmischungen!AG29,1)","v":{"v":0,"d":"0.0"}},{"$f":"ROUND(Eigenmischungen!AG30,0)","v":0},{"$f":"ROUND(Eigenmischungen!AG31,2)","v":{"v":0,"d":"0%"}},{"$f":"ROUND(Eigenmischungen!AG32,0)","v":0},{"$f":"ROUND(Eigenmischungen!AG33,1)","v":{"v":0,"d":"0.0"}},{"$f":"ROUND(Eigenmischungen!AG34,1)","v":{"v":0,"d":"0.0"}},{"$f":"ROUND(Eigenmischungen!AG35,0)","v":0},{"$f":"ROUND(Eigenmischungen!AG36,0)","v":0},{"$f":"ROUND(Eigenmischungen!AG37,0)","v":0},{"$f":"ROUND(Eigenmischungen!AG38,0)","v":0},{"$f":"ROUND(Eigenmischungen!AG39,0)","v":0},{"$f":"ROUND(Eigenmischungen!AG40,0)","v":0},{"$f":"ROUND(Eigenmischungen!AG41,0)","v":0},{"$f":"ROUND(Eigenmischungen!AG42,2)","v":{"v":0,"d":"0%"}},{"$f":"ROUND(Eigenmischungen!AG43,0)","v":0},{"$f":"ROUND(Eigenmischungen!AG44,1)","v":{"v":0,"d":"0.0"}},{"$f":"ROUND(Eigenmischungen!AG45,1)","v":{"v":0,"d":"0.0"}},{"$f":"ROUND(Eigenmischungen!AG46,1)","v":{"v":0,"d":"0.0"}},{"$f":"ROUND(Eigenmischungen!AG47,1)","v":{"v":0,"d":"0.0"}},{"$f":"ROUND(Eigenmischungen!AG48,1)","v":{"v":0,"d":"0.0"}},{"$f":"ROUND(Eigenmischungen!AG49,1)","v":{"v":0,"d":"0.0"}},{"$f":"ROUND(Eigenmischungen!AH50,1)","v":{"v":0,"d":"0.0"}},{"$f":"ROUND(Eigenmischungen!AG26,1)","v":{"v":0,"d":"0.0"}},{"$f":"ROUND(Eigenmischungen!AJ47,1)","v":{"v":0,"d":"0.0"}},{"$f":"ROUND(Eigenmischungen!AK47,1)","v":{"v":0,"d":"0.0"}},{"$f":"ROUND(Eigenmischungen!AL47,1)","v":{"v":0,"d":"0.0"}},{"$f":"ROUND(Eigenmischungen!AM47,1)","v":{"v":0,"d":"0.0"}},{"$f":"ROUND(Eigenmischungen!AN47,1)","v":{"v":0,"d":"0.0"}},{"$f":"ROUND(Eigenmischungen!AO47,1)","v":{"v":0,"d":"0.0"}},{"$f":"ROUND(Eigenmischungen!AP47,1)","v":{"v":0,"d":"0.0"}}]
[null,{"$f":"Eigenmischungen!AH2","v":"Mischung ..."},{"$f":"ROUND(Eigenmischungen!AH27*10,-1)","v":0},{"$f":"ROUND(Eigenmischungen!AH28,1)","v":{"v":0,"d":"0.0"}},{"$f":"ROUND(Eigenmischungen!AH29,1)","v":{"v":0,"d":"0.0"}},{"$f":"ROUND(Eigenmischungen!AH30,0)","v":0},{"$f":"ROUND(Eigenmischungen!AH31,2)","v":{"v":0,"d":"0%"}},{"$f":"ROUND(Eigenmischungen!AH32,0)","v":0},{"$f":"ROUND(Eigenmischungen!AH33,1)","v":{"v":0,"d":"0.0"}},{"$f":"ROUND(Eigenmischungen!AH34,1)","v":{"v":0,"d":"0.0"}},{"$f":"ROUND(Eigenmischungen!AH35,0)","v":0},{"$f":"ROUND(Eigenmischungen!AH36,0)","v":0},{"$f":"ROUND(Eigenmischungen!AH37,0)","v":0},{"$f":"ROUND(Eigenmischungen!AH38,0)","v":0},{"$f":"ROUND(Eigenmischungen!AH39,0)","v":0},{"$f":"ROUND(Eigenmischungen!AH40,0)","v":0},{"$f":"ROUND(Eigenmischungen!AH41,0)","v":0},{"$f":"ROUND(Eigenmischungen!AH42,2)","v":{"v":0,"d":"0%"}},{"$f":"ROUND(Eigenmischungen!AH43,0)","v":0},{"$f":"ROUND(Eigenmischungen!AH44,1)","v":{"v":0,"d":"0.0"}},{"$f":"ROUND(Eigenmischungen!AH45,1)","v":{"v":0,"d":"0.0"}},{"$f":"ROUND(Eigenmischungen!AH46,1)","v":{"v":0,"d":"0.0"}},{"$f":"ROUND(Eigenmischungen!AH47,1)","v":{"v":0,"d":"0.0"}},{"$f":"ROUND(Eigenmischungen!AH48,1)","v":{"v":0,"d":"0.0"}},{"$f":"ROUND(Eigenmischungen!AH49,1)","v":{"v":0,"d":"0.0"}},{"$f":"ROUND(Eigenmischungen!AI50,1)","v":{"v":0,"d":"0.0"}},{"$f":"ROUND(Eigenmischungen!AH26,1)","v":{"v":0,"d":"0.0"}},{"$f":"ROUND(Eigenmischungen!AK47,1)","v":{"v":0,"d":"0.0"}},{"$f":"ROUND(Eigenmischungen!AL47,1)","v":{"v":0,"d":"0.0"}},{"$f":"ROUND(Eigenmischungen!AM47,1)","v":{"v":0,"d":"0.0"}},{"$f":"ROUND(Eigenmischungen!AN47,1)","v":{"v":0,"d":"0.0"}},{"$f":"ROUND(Eigenmischungen!AO47,1)","v":{"v":0,"d":"0.0"}},{"$f":"ROUND(Eigenmischungen!AP47,1)","v":{"v":0,"d":"0.0"}},{"$f":"ROUND(Eigenmischungen!AQ47,1)","v":{"v":0,"d":"0.0"}}]
[null,{"$f":"Eigenmischungen!AI2","v":"Mischung ..."},{"$f":"ROUND(Eigenmischungen!AI27*10,-1)","v":0},{"$f":"ROUND(Eigenmischungen!AI28,1)","v":{"v":0,"d":"0.0"}},{"$f":"ROUND(Eigenmischungen!AI29,1)","v":{"v":0,"d":"0.0"}},{"$f":"ROUND(Eigenmischungen!AI30,0)","v":0},{"$f":"ROUND(Eigenmischungen!AI31,2)","v":{"v":0,"d":"0%"}},{"$f":"ROUND(Eigenmischungen!AI32,0)","v":0},{"$f":"ROUND(Eigenmischungen!AI33,1)","v":{"v":0,"d":"0.0"}},{"$f":"ROUND(Eigenmischungen!AI34,1)","v":{"v":0,"d":"0.0"}},{"$f":"ROUND(Eigenmischungen!AI35,0)","v":0},{"$f":"ROUND(Eigenmischungen!AI36,0)","v":0},{"$f":"ROUND(Eigenmischungen!AI37,0)","v":0},{"$f":"ROUND(Eigenmischungen!AI38,0)","v":0},{"$f":"ROUND(Eigenmischungen!AI39,0)","v":0},{"$f":"ROUND(Eigenmischungen!AI40,0)","v":0},{"$f":"ROUND(Eigenmischungen!AI41,0)","v":0},{"$f":"ROUND(Eigenmischungen!AI42,2)","v":{"v":0,"d":"0%"}},{"$f":"ROUND(Eigenmischungen!AI43,0)","v":0},{"$f":"ROUND(Eigenmischungen!AI44,1)","v":{"v":0,"d":"0.0"}},{"$f":"ROUND(Eigenmischungen!AI45,1)","v":{"v":0,"d":"0.0"}},{"$f":"ROUND(Eigenmischungen!AI46,1)","v":{"v":0,"d":"0.0"}},{"$f":"ROUND(Eigenmischungen!AI47,1)","v":{"v":0,"d":"0.0"}},{"$f":"ROUND(Eigenmischungen!AI48,1)","v":{"v":0,"d":"0.0"}},{"$f":"ROUND(Eigenmischungen!AI49,1)","v":{"v":0,"d":"0.0"}},{"$f":"ROUND(Eigenmischungen!AJ50,1)","v":{"v":0,"d":"0.0"}},{"$f":"ROUND(Eigenmischungen!AI26,1)","v":{"v":0,"d":"0.0"}},{"$f":"ROUND(Eigenmischungen!AL47,1)","v":{"v":0,"d":"0.0"}},{"$f":"ROUND(Eigenmischungen!AM47,1)","v":{"v":0,"d":"0.0"}},{"$f":"ROUND(Eigenmischungen!AN47,1)","v":{"v":0,"d":"0.0"}},{"$f":"ROUND(Eigenmischungen!AO47,1)","v":{"v":0,"d":"0.0"}},{"$f":"ROUND(Eigenmischungen!AP47,1)","v":{"v":0,"d":"0.0"}},{"$f":"ROUND(Eigenmischungen!AQ47,1)","v":{"v":0,"d":"0.0"}},{"$f":"ROUND(Eigenmischungen!AR47,1)","v":{"v":0,"d":"0.0"}}]
[null,{"$f":"Eigenmischungen!AJ2","v":"Mischung ..."},{"$f":"ROUND(Eigenmischungen!AJ27*10,-1)","v":0},{"$f":"ROUND(Eigenmischungen!AJ28,1)","v":{"v":0,"d":"0.0"}},{"$f":"ROUND(Eigenmischungen!AJ29,1)","v":{"v":0,"d":"0.0"}},{"$f":"ROUND(Eigenmischungen!AJ30,0)","v":0},{"$f":"ROUND(Eigenmischungen!AJ31,2)","v":{"v":0,"d":"0%"}},{"$f":"ROUND(Eigenmischungen!AJ32,0)","v":0},{"$f":"ROUND(Eigenmischungen!AJ33,1)","v":{"v":0,"d":"0.0"}},{"$f":"ROUND(Eigenmischungen!AJ34,1)","v":{"v":0,"d":"0.0"}},{"$f":"ROUND(Eigenmischungen!AJ35,0)","v":0},{"$f":"ROUND(Eigenmischungen!AJ36,0)","v":0},{"$f":"ROUND(Eigenmischungen!AJ37,0)","v":0},{"$f":"ROUND(Eigenmischungen!AJ38,0)","v":0},{"$f":"ROUND(Eigenmischungen!AJ39,0)","v":0},{"$f":"ROUND(Eigenmischungen!AJ40,0)","v":0},{"$f":"ROUND(Eigenmischungen!AJ41,0)","v":0},{"$f":"ROUND(Eigenmischungen!AJ42,2)","v":{"v":0,"d":"0%"}},{"$f":"ROUND(Eigenmischungen!AJ43,0)","v":0},{"$f":"ROUND(Eigenmischungen!AJ44,1)","v":{"v":0,"d":"0.0"}},{"$f":"ROUND(Eigenmischungen!AJ45,1)","v":{"v":0,"d":"0.0"}},{"$f":"ROUND(Eigenmischungen!AJ46,1)","v":{"v":0,"d":"0.0"}},{"$f":"ROUND(Eigenmischungen!AJ47,1)","v":{"v":0,"d":"0.0"}},{"$f":"ROUND(Eigenmischungen!AJ48,1)","v":{"v":0,"d":"0.0"}},{"$f":"ROUND(Eigenmischungen!AJ49,1)","v":{"v":0,"d":"0.0"}},{"$f":"ROUND(Eigenmischungen!AK50,1)","v":{"v":0,"d":"0.0"}},{"$f":"ROUND(Eigenmischungen!AJ26,1)","v":{"v":0,"d":"0.0"}},{"$f":"ROUND(Eigenmischungen!AM47,1)","v":{"v":0,"d":"0.0"}},{"$f":"ROUND(Eigenmischungen!AN47,1)","v":{"v":0,"d":"0.0"}},{"$f":"ROUND(Eigenmischungen!AO47,1)","v":{"v":0,"d":"0.0"}},{"$f":"ROUND(Eigenmischungen!AP47,1)","v":{"v":0,"d":"0.0"}},{"$f":"ROUND(Eigenmischungen!AQ47,1)","v":{"v":0,"d":"0.0"}},{"$f":"ROUND(Eigenmischungen!AR47,1)","v":{"v":0,"d":"0.0"}},{"$f":"ROUND(Eigenmischungen!AS47,1)","v":{"v":0,"d":"0.0"}}]
[null,{"$f":"Eigenmischungen!AK2","v":"Mischung ..."},{"$f":"ROUND(Eigenmischungen!AK27*10,-1)","v":0},{"$f":"ROUND(Eigenmischungen!AK28,1)","v":{"v":0,"d":"0.0"}},{"$f":"ROUND(Eigenmischungen!AK29,1)","v":{"v":0,"d":"0.0"}},{"$f":"ROUND(Eigenmischungen!AK30,0)","v":0},{"$f":"ROUND(Eigenmischungen!AK31,2)","v":{"v":0,"d":"0%"}},{"$f":"ROUND(Eigenmischungen!AK32,0)","v":0},{"$f":"ROUND(Eigenmischungen!AK33,1)","v":{"v":0,"d":"0.0"}},{"$f":"ROUND(Eigenmischungen!AK34,1)","v":{"v":0,"d":"0.0"}},{"$f":"ROUND(Eigenmischungen!AK35,0)","v":0},{"$f":"ROUND(Eigenmischungen!AK36,0)","v":0},{"$f":"ROUND(Eigenmischungen!AK37,0)","v":0},{"$f":"ROUND(Eigenmischungen!AK38,0)","v":0},{"$f":"ROUND(Eigenmischungen!AK39,0)","v":0},{"$f":"ROUND(Eigenmischungen!AK40,0)","v":0},{"$f":"ROUND(Eigenmischungen!AK41,0)","v":0},{"$f":"ROUND(Eigenmischungen!AK42,2)","v":{"v":0,"d":"0%"}},{"$f":"ROUND(Eigenmischungen!AK43,0)","v":0},{"$f":"ROUND(Eigenmischungen!AK44,1)","v":{"v":0,"d":"0.0"}},{"$f":"ROUND(Eigenmischungen!AK45,1)","v":{"v":0,"d":"0.0"}},{"$f":"ROUND(Eigenmischungen!AK46,1)","v":{"v":0,"d":"0.0"}},{"$f":"ROUND(Eigenmischungen!AK47,1)","v":{"v":0,"d":"0.0"}},{"$f":"ROUND(Eigenmischungen!AK48,1)","v":{"v":0,"d":"0.0"}},{"$f":"ROUND(Eigenmischungen!AK49,1)","v":{"v":0,"d":"0.0"}},{"$f":"ROUND(Eigenmischungen!AL50,1)","v":{"v":0,"d":"0.0"}},{"$f":"ROUND(Eigenmischungen!AK26,1)","v":{"v":0,"d":"0.0"}},{"$f":"ROUND(Eigenmischungen!AN47,1)","v":{"v":0,"d":"0.0"}},{"$f":"ROUND(Eigenmischungen!AO47,1)","v":{"v":0,"d":"0.0"}},{"$f":"ROUND(Eigenmischungen!AP47,1)","v":{"v":0,"d":"0.0"}},{"$f":"ROUND(Eigenmischungen!AQ47,1)","v":{"v":0,"d":"0.0"}},{"$f":"ROUND(Eigenmischungen!AR47,1)","v":{"v":0,"d":"0.0"}},{"$f":"ROUND(Eigenmischungen!AS47,1)","v":{"v":0,"d":"0.0"}},{"$f":"ROUND(Eigenmischungen!AT47,1)","v":{"v":0,"d":"0.0"}}]
[]
[null,{"$f":"'TMR-Mischplan'!AN2","v":"Mischung 1"},{"$f":"ROUND('TMR-Mischplan'!AN42*1000,-1)","v":0},{"$f":"ROUND('TMR-Mischplan'!AN30,1)","v":{"v":0,"d":"0.0"}},{"$f":"ROUND('TMR-Mischplan'!AN31,1)","v":{"v":0,"d":"0.0"}},{"$f":"ROUND('TMR-Mischplan'!AN46,0)","v":0},{"$f":"'TMR-Mischplan'!AN47","v":{"v":0,"d":"0%"}},{"$f":"ROUND('TMR-Mischplan'!AN32,0)","v":0},{"$f":"ROUND('TMR-Mischplan'!AN33,1)","v":{"v":0,"d":"0.0"}},{"$f":"ROUND('TMR-Mischplan'!AN37,1)","v":{"v":0,"d":"0.0"}},{"$f":"ROUND('TMR-Mischplan'!AN35,0)","v":0},{"$f":"ROUND('TMR-Mischplan'!AN36,0)","v":0},{"$f":"ROUND('TMR-Mischplan'!AX26,0)","v":0},null,{"$f":"ROUND('TMR-Mischplan'!AX27,0)","v":0},{"$f":"ROUND('TMR-Mischplan'!AX28,0)","v":0},{"$f":"ROUND('TMR-Mischplan'!AN58,0)","v":0},null,{"$f":"ROUND('TMR-Mischplan'!AN60,0)","v":0},{"$f":"ROUND('TMR-Mischplan'!AX29,1)","v":{"v":0,"d":"0.0"}},{"$f":"ROUND('TMR-Mischplan'!AX30,1)","v":{"v":0,"d":"0.0"}},{"$f":"ROUND('TMR-Mischplan'!AX31,1)","v":{"v":0,"d":"0.0"}},{"$f":"ROUND('TMR-Mischplan'!AX32,1)","v":{"v":0,"d":"0.0"}},{"$f":"ROUND('TMR-Mischplan'!AX33,1)","v":{"v":0,"d":"0.0"}},{"$f":"ROUND('TMR-Mischplan'!AX34,1)","v":{"v":0,"d":"0.0"}},{"$f":"ROUND('TMR-Mischplan'!AY35,1)","v":{"v":0,"d":"0.0"}}]
[null,{"$f":"'TMR-Mischplan'!AO2","v":"Mischung 2"},{"$f":"ROUND('TMR-Mischplan'!AO42*1000,-1)","v":0},{"$f":"ROUND('TMR-Mischplan'!AO30,1)","v":{"v":0,"d":"0.0"}},{"$f":"ROUND('TMR-Mischplan'!AO31,1)","v":{"v":0,"d":"0.0"}},{"$f":"ROUND('TMR-Mischplan'!AO46,0)","v":0},{"$f":"'TMR-Mischplan'!AO47","v":{"v":0,"d":"0%"}},{"$f":"ROUND('TMR-Mischplan'!AO32,0)","v":0},{"$f":"ROUND('TMR-Mischplan'!AO33,1)","v":{"v":0,"d":"0.0"}},{"$f":"ROUND('TMR-Mischplan'!AO37,1)","v":{"v":0,"d":"0.0"}},{"$f":"ROUND('TMR-Mischplan'!AO35,0)","v":0},{"$f":"ROUND('TMR-Mischplan'!AO36,0)","v":0},{"$f":"ROUND('TMR-Mischplan'!AY26,0)","v":0},null,{"$f":"ROUND('TMR-Mischplan'!AY27,0)","v":0},{"$f":"ROUND('TMR-Mischplan'!AY28,0)","v":0},{"$f":"ROUND('TMR-Mischplan'!AO58,0)","v":0},null,{"$f":"ROUND('TMR-Mischplan'!AO60,0)","v":0},{"$f":"ROUND('TMR-Mischplan'!AY29,1)","v":{"v":0,"d":"0.0"}},{"$f":"ROUND('TMR-Mischplan'!AY30,1)","v":{"v":0,"d":"0.0"}},{"$f":"ROUND('TMR-Mischplan'!AY31,1)","v":{"v":0,"d":"0.0"}},{"$f":"ROUND('TMR-Mischplan'!AY32,1)","v":{"v":0,"d":"0.0"}},{"$f":"ROUND('TMR-Mischplan'!AY33,1)","v":{"v":0,"d":"0.0"}},{"$f":"ROUND('TMR-Mischplan'!AY34,1)","v":{"v":0,"d":"0.0"}},{"$f":"ROUND('TMR-Mischplan'!AZ35,1)","v":{"v":0,"d":"0.0"}}]
[null,{"$f":"'TMR-Mischplan'!AP2","v":"Mischung 3"},{"$f":"ROUND('TMR-Mischplan'!AP42*1000,-1)","v":0},{"$f":"ROUND('TMR-Mischplan'!AP30,1)","v":{"v":0,"d":"0.0"}},{"$f":"ROUND('TMR-Mischplan'!AP31,1)","v":{"v":0,"d":"0.0"}},{"$f":"ROUND('TMR-Mischplan'!AP46,0)","v":0},{"$f":"'TMR-Mischplan'!AP47","v":{"v":0,"d":"0%"}},{"$f":"ROUND('TMR-Mischplan'!AP32,0)","v":0},{"$f":"ROUND('TMR-Mischplan'!AP33,1)","v":{"v":0,"d":"0.0"}},{"$f":"ROUND('TMR-Mischplan'!AP37,1)","v":{"v":0,"d":"0.0"}},{"$f":"ROUND('TMR-Mischplan'!AP35,0)","v":0},{"$f":"ROUND('TMR-Mischplan'!AP36,0)","v":0},{"$f":"ROUND('TMR-Mischplan'!AZ26,0)","v":0},null,{"$f":"ROUND('TMR-Mischplan'!AZ27,0)","v":0},{"$f":"ROUND('TMR-Mischplan'!AZ28,0)","v":0},{"$f":"ROUND('TMR-Mischplan'!AP58,0)","v":0},null,{"$f":"ROUND('TMR-Mischplan'!AP60,0)","v":0},{"$f":"ROUND('TMR-Mischplan'!AZ29,1)","v":{"v":0,"d":"0.0"}},{"$f":"ROUND('TMR-Mischplan'!AZ30,1)","v":{"v":0,"d":"0.0"}},{"$f":"ROUND('TMR-Mischplan'!AZ31,1)","v":{"v":0,"d":"0.0"}},{"$f":"ROUND('TMR-Mischplan'!AZ32,1)","v":{"v":0,"d":"0.0"}},{"$f":"ROUND('TMR-Mischplan'!AZ33,1)","v":{"v":0,"d":"0.0"}},{"$f":"ROUND('TMR-Mischplan'!AZ34,1)","v":{"v":0,"d":"0.0"}},{"$f":"ROUND('TMR-Mischplan'!BA35,1)","v":{"v":0,"d":"0.0"}}]
[null,{"$f":"'TMR-Mischplan'!AQ2","v":"Mischung 4"},{"$f":"ROUND('TMR-Mischplan'!AQ42*1000,-1)","v":0},{"$f":"ROUND('TMR-Mischplan'!AQ30,1)","v":{"v":0,"d":"0.0"}},{"$f":"ROUND('TMR-Mischplan'!AQ31,1)","v":{"v":0,"d":"0.0"}},{"$f":"ROUND('TMR-Mischplan'!AQ46,0)","v":0},{"$f":"'TMR-Mischplan'!AQ47","v":{"v":0,"d":"0%"}},{"$f":"ROUND('TMR-Mischplan'!AQ32,0)","v":0},{"$f":"ROUND('TMR-Mischplan'!AQ33,1)","v":{"v":0,"d":"0.0"}},{"$f":"ROUND('TMR-Mischplan'!AQ37,1)","v":{"v":0,"d":"0.0"}},{"$f":"ROUND('TMR-Mischplan'!AQ35,0)","v":0},{"$f":"ROUND('TMR-Mischplan'!AQ36,0)","v":0},{"$f":"ROUND('TMR-Mischplan'!BA26,0)","v":0},null,{"$f":"ROUND('TMR-Mischplan'!BA27,0)","v":0},{"$f":"ROUND('TMR-Mischplan'!BA28,0)","v":0},{"$f":"ROUND('TMR-Mischplan'!AQ58,0)","v":0},null,{"$f":"ROUND('TMR-Mischplan'!AQ60,0)","v":0},{"$f":"ROUND('TMR-Mischplan'!BA29,1)","v":{"v":0,"d":"0.0"}},{"$f":"ROUND('TMR-Mischplan'!BA30,1)","v":{"v":0,"d":"0.0"}},{"$f":"ROUND('TMR-Mischplan'!BA31,1)","v":{"v":0,"d":"0.0"}},{"$f":"ROUND('TMR-Mischplan'!BA32,1)","v":{"v":0,"d":"0.0"}},{"$f":"ROUND('TMR-Mischplan'!BA33,1)","v":{"v":0,"d":"0.0"}},{"$f":"ROUND('TMR-Mischplan'!BA34,1)","v":{"v":0,"d":"0.0"}},{"$f":"ROUND('TMR-Mischplan'!BB35,1)","v":{"v":0,"d":"0.0"}}]
[null,{"$f":"'TMR-Mischplan'!AR2","v":"Mischung 5"},{"$f":"ROUND('TMR-Mischplan'!AR42*1000,-1)","v":0},{"$f":"ROUND('TMR-Mischplan'!AR30,1)","v":{"v":0,"d":"0.0"}},{"$f":"ROUND('TMR-Mischplan'!AR31,1)","v":{"v":0,"d":"0.0"}},{"$f":"ROUND('TMR-Mischplan'!AR46,0)","v":0},{"$f":"'TMR-Mischplan'!AR47","v":{"v":0,"d":"0%"}},{"$f":"ROUND('TMR-Mischplan'!AR32,0)","v":0},{"$f":"ROUND('TMR-Mischplan'!AR33,1)","v":{"v":0,"d":"0.0"}},{"$f":"ROUND('TMR-Mischplan'!AR37,1)","v":{"v":0,"d":"0.0"}},{"$f":"ROUND('TMR-Mischplan'!AR34,0)","v":0},{"$f":"ROUND('TMR-Mischplan'!AR35,0)","v":0},{"$f":"ROUND('TMR-Mischplan'!BB26,0)","v":0},null,{"$f":"ROUND('TMR-Mischplan'!BB27,0)","v":0},{"$f":"ROUND('TMR-Mischplan'!BB28,0)","v":0},{"$f":"ROUND('TMR-Mischplan'!AR58,0)","v":0},null,{"$f":"ROUND('TMR-Mischplan'!AR60,0)","v":0},{"$f":"ROUND('TMR-Mischplan'!BB29,1)","v":{"v":0,"d":"0.0"}},{"$f":"ROUND('TMR-Mischplan'!BB30,1)","v":{"v":0,"d":"0.0"}},{"$f":"ROUND('TMR-Mischplan'!BB31,1)","v":{"v":0,"d":"0.0"}},{"$f":"ROUND('TMR-Mischplan'!BB32,1)","v":{"v":0,"d":"0.0"}},{"$f":"ROUND('TMR-Mischplan'!BB33,1)","v":{"v":0,"d":"0.0"}},{"$f":"ROUND('TMR-Mischplan'!BB34,1)","v":{"v":0,"d":"0.0"}},{"$f":"ROUND('TMR-Mischplan'!BC35,1)","v":{"v":0,"d":"0.0"}}]
[null,{"$f":"'TMR-Mischplan'!AS2","v":"Mischung 6"},{"$f":"ROUND('TMR-Mischplan'!AS42*1000,-1)","v":0},{"$f":"ROUND('TMR-Mischplan'!AS30,1)","v":{"v":0,"d":"0.0"}},{"$f":"ROUND('TMR-Mischplan'!AS31,1)","v":{"v":0,"d":"0.0"}},{"$f":"ROUND('TMR-Mischplan'!AS46,0)","v":0},{"$f":"'TMR-Mischplan'!AS47","v":{"v":0,"d":"0%"}},{"$f":"ROUND('TMR-Mischplan'!AS32,0)","v":0},{"$f":"ROUND('TMR-Mischplan'!AS33,1)","v":{"v":0,"d":"0.0"}},{"$f":"ROUND('TMR-Mischplan'!AS37,1)","v":{"v":0,"d":"0.0"}},{"$f":"ROUND('TMR-Mischplan'!AS34,0)","v":0},{"$f":"ROUND('TMR-Mischplan'!AS35,0)","v":0},{"$f":"ROUND('TMR-Mischplan'!BC26,0)","v":0},null,{"$f":"ROUND('TMR-Mischplan'!BC27,0)","v":0},{"$f":"ROUND('TMR-Mischplan'!BC28,0)","v":0},{"$f":"ROUND('TMR-Mischplan'!AS58,0)","v":0},null,{"$f":"ROUND('TMR-Mischplan'!AS60,0)","v":0},{"$f":"ROUND('TMR-Mischplan'!BC29,1)","v":{"v":0,"d":"0.0"}},{"$f":"ROUND('TMR-Mischplan'!BC30,1)","v":{"v":0,"d":"0.0"}},{"$f":"ROUND('TMR-Mischplan'!BC31,1)","v":{"v":0,"d":"0.0"}},{"$f":"ROUND('TMR-Mischplan'!BC32,1)","v":{"v":0,"d":"0.0"}},{"$f":"ROUND('TMR-Mischplan'!BC33,1)","v":{"v":0,"d":"0.0"}},{"$f":"ROUND('TMR-Mischplan'!BC34,1)","v":{"v":0,"d":"0.0"}},{"$f":"ROUND('TMR-Mischplan'!BD35,1)","v":{"v":0,"d":"0.0"}}]
[null,{"$f":"'TMR-Mischplan'!AT2","v":"Mischung 7"},{"$f":"ROUND('TMR-Mischplan'!AT42*1000,-1)","v":0},{"$f":"ROUND('TMR-Mischplan'!AT30,1)","v":{"v":0,"d":"0.0"}},{"$f":"ROUND('TMR-Mischplan'!AT31,1)","v":{"v":0,"d":"0.0"}},{"$f":"ROUND('TMR-Mischplan'!AT46,0)","v":0},{"$f":"'TMR-Mischplan'!AT47","v":{"v":0,"d":"0%"}},{"$f":"ROUND('TMR-Mischplan'!AT32,0)","v":0},{"$f":"ROUND('TMR-Mischplan'!AT33,1)","v":{"v":0,"d":"0.0"}},{"$f":"ROUND('TMR-Mischplan'!AT37,1)","v":{"v":0,"d":"0.0"}},{"$f":"ROUND('TMR-Mischplan'!AT34,0)","v":0},{"$f":"ROUND('TMR-Mischplan'!AT35,0)","v":0},{"$f":"ROUND('TMR-Mischplan'!BD26,0)","v":0},null,{"$f":"ROUND('TMR-Mischplan'!BD27,0)","v":0},{"$f":"ROUND('TMR-Mischplan'!BD28,0)","v":0},{"$f":"ROUND('TMR-Mischplan'!AT58,0)","v":0},null,{"$f":"ROUND('TMR-Mischplan'!AT60,0)","v":0},{"$f":"ROUND('TMR-Mischplan'!BD29,1)","v":{"v":0,"d":"0.0"}},{"$f":"ROUND('TMR-Mischplan'!BD30,1)","v":{"v":0,"d":"0.0"}},{"$f":"ROUND('TMR-Mischplan'!BD31,1)","v":{"v":0,"d":"0.0"}},{"$f":"ROUND('TMR-Mischplan'!BD32,1)","v":{"v":0,"d":"0.0"}},{"$f":"ROUND('TMR-Mischplan'!BD33,1)","v":{"v":0,"d":"0.0"}},{"$f":"ROUND('TMR-Mischplan'!BD34,1)","v":{"v":0,"d":"0.0"}},{"$f":"ROUND('TMR-Mischplan'!BE35,1)","v":{"v":0,"d":"0.0"}}]
[null,{"$f":"'TMR-Mischplan'!AU2","v":"Mischung 8"},{"$f":"ROUND('TMR-Mischplan'!AU42*1000,-1)","v":0},{"$f":"ROUND('TMR-Mischplan'!AU30,1)","v":{"v":0,"d":"0.0"}},{"$f":"ROUND('TMR-Mischplan'!AU31,1)","v":{"v":0,"d":"0.0"}},{"$f":"ROUND('TMR-Mischplan'!AU46,0)","v":0},{"$f":"'TMR-Mischplan'!AU47","v":{"v":0,"d":"0%"}},{"$f":"ROUND('TMR-Mischplan'!AU32,0)","v":0},{"$f":"ROUND('TMR-Mischplan'!AU33,1)","v":{"v":0,"d":"0.0"}},{"$f":"ROUND('TMR-Mischplan'!AU37,1)","v":{"v":0,"d":"0.0"}},{"$f":"ROUND('TMR-Mischplan'!AU34,0)","v":0},{"$f":"ROUND('TMR-Mischplan'!AU35,0)","v":0},{"$f":"ROUND('TMR-Mischplan'!BE26,0)","v":0},null,{"$f":"ROUND('TMR-Mischplan'!BE27,0)","v":0},{"$f":"ROUND('TMR-Mischplan'!BE28,0)","v":0},{"$f":"ROUND('TMR-Mischplan'!AU58,0)","v":0},null,{"$f":"ROUND('TMR-Mischplan'!AU60,0)","v":0},{"$f":"ROUND('TMR-Mischplan'!BE29,1)","v":{"v":0,"d":"0.0"}},{"$f":"ROUND('TMR-Mischplan'!BE30,1)","v":{"v":0,"d":"0.0"}},{"$f":"ROUND('TMR-Mischplan'!BE31,1)","v":{"v":0,"d":"0.0"}},{"$f":"ROUND('TMR-Mischplan'!BE32,1)","v":{"v":0,"d":"0.0"}},{"$f":"ROUND('TMR-Mischplan'!BE33,1)","v":{"v":0,"d":"0.0"}},{"$f":"ROUND('TMR-Mischplan'!BE34,1)","v":{"v":0,"d":"0.0"}},{"$f":"ROUND('TMR-Mischplan'!BF35,1)","v":{"v":0,"d":"0.0"}}]
[null,{"$f":"'TMR-Mischplan'!AV2","v":"Mischung 9"},{"$f":"ROUND('TMR-Mischplan'!AV42*1000,-1)","v":0},{"$f":"ROUND('TMR-Mischplan'!AV30,1)","v":{"v":0,"d":"0.0"}},{"$f":"ROUND('TMR-Mischplan'!AV31,1)","v":{"v":0,"d":"0.0"}},{"$f":"ROUND('TMR-Mischplan'!AV46,0)","v":0},{"$f":"'TMR-Mischplan'!AV47","v":{"v":0,"d":"0%"}},{"$f":"ROUND('TMR-Mischplan'!AV32,0)","v":0},{"$f":"ROUND('TMR-Mischplan'!AV33,1)","v":{"v":0,"d":"0.0"}},{"$f":"ROUND('TMR-Mischplan'!AV37,1)","v":{"v":0,"d":"0.0"}},{"$f":"ROUND('TMR-Mischplan'!AV34,0)","v":0},{"$f":"ROUND('TMR-Mischplan'!AV35,0)","v":0},{"$f":"ROUND('TMR-Mischplan'!BF26,0)","v":0},null,{"$f":"ROUND('TMR-Mischplan'!BF27,0)","v":0},{"$f":"ROUND('TMR-Mischplan'!BF28,0)","v":0},{"$f":"ROUND('TMR-Mischplan'!AV58,0)","v":0},null,{"$f":"ROUND('TMR-Mischplan'!AV60,0)","v":0},{"$f":"ROUND('TMR-Mischplan'!BF29,1)","v":{"v":0,"d":"0.0"}},{"$f":"ROUND('TMR-Mischplan'!BF30,1)","v":{"v":0,"d":"0.0"}},{"$f":"ROUND('TMR-Mischplan'!BF31,1)","v":{"v":0,"d":"0.0"}},{"$f":"ROUND('TMR-Mischplan'!BF32,1)","v":{"v":0,"d":"0.0"}},{"$f":"ROUND('TMR-Mischplan'!BF33,1)","v":{"v":0,"d":"0.0"}},{"$f":"ROUND('TMR-Mischplan'!BF34,1)","v":{"v":0,"d":"0.0"}},{"$f":"ROUND('TMR-Mischplan'!BG35,1)","v":{"v":0,"d":"0.0"}}]
[]
["Frischfutter",null,1E-4,1E-4,1E-4,1E-4,1E-4,1E-4,1E-4,1E-4,1E-4,1E-4,1E-4,1E-4,1E-4,1E-4,1E-4,1E-4,1E-4,1E-4,1E-4,1E-4,1E-4,1E-4,1E-4]
[null,"Futterrübe (gehaltvolle), sauber",190,7.9,{"$f":"D56/0.6","v":{"v":13.166666666666668,"d":"13.2"}},68,{"v":0.2,"d":"20%"},{"$f":"ROUND((11.93-(6.82*G56))*E56+1.03*G56*F56,0)","v":153},{"$f":"IF((F56-H56)/6.25<0,ROUND((F56-H56)/6.25,0),\"+\"&ROUND(((F56-H56)/6.25),0))","v":-14},1.05,{"$f":"11/0.19","v":{"v":57.89473684210526,"d":"58"}},{"$f":"18/0.19","v":{"v":94.73684210526315,"d":"95"}},{"$f":"IF(AND(S56<>\"\",F56<>\"\",L56<>\"\",P56<>\"\"),1000-F56-L56-P56-S56,\"Fehler\")","v":{"v":651.2631578947369,"d":"651"}},0,615,5,47,0,181,2.1,{"$f":"0.4/0.19","v":{"v":2.1052631578947367,"d":"2.1"}},{"$f":"0.1/0.19","v":{"v":0.5263157894736842,"d":"0.5"}},{"$f":"0.2/0.19","v":{"v":1.0526315789473684,"d":"1.1"}},{"$f":"3.4/0.19","v":{"v":17.894736842105264,"d":"17.9"}},"...",470,null,{"$f":"IF(COUNTA(B56:Y56)<21,\"x\",\"\")","v":""}]
[null,"Grünland, 2. Nutzung, BW extensiv, gut",172,6.1,10.2,158,{"v":0.1,"d":"10%"},131,{"$f":"IF((F57-H57)/6.25<0,ROUND((F57-H57)/6.25,0),\"+\"&ROUND(((F57-H57)/6.25),0))","v":"+4"},{"$f":"ROUND(L57*0.006+0.15,1)","v":{"v":3.3,"d":"3.30"}},301,522,{"$f":"IF(AND(S57<>\"\",F57<>\"\",L57<>\"\",P57<>\"\"),1000-F57-L57-P57-S57,\"Fehler\")","v":190},0,92,32,238,{"v":0.75,"d":"75%"},98,4.4,4.4,0.6,2.4,26.4,null,{"$f":"14*X57+3.5","v":{"v":373.09999999999997,"d":"373"}}]
[null,"Grünland, 2. Nutzung, BW extensiv, mittel",220,{"v":5.75,"d":"5.8"},{"v":9.76,"d":"9.8"},134,{"v":0.15,"d":"15%"},127,{"$f":"IF((F58-H58)/6.25<0,ROUND((F58-H58)/6.25,0),\"+\"&ROUND(((F58-H58)/6.25),0))","v":"+1"},{"$f":"ROUND(L58*0.006+0.15,1)","v":{"v":3.5,"d":"3.50"}},340,559,{"$f":"IF(AND(S58<>\"\",F58<>\"\",L58<>\"\",P58<>\"\"),1000-F58-L58-P58-S58,\"Fehler\")","v":202},0,95,28,316,{"v":0.8,"d":"80%"},77,4.4,4.4,0.6,2.4,26.4,null,{"$f":"14*X58+3.5","v":{"v":373.09999999999997,"d":"373"}}]
[null,"Grünland, 2. Nutzung, BW extensiv, gering",{"$f":"C58+C58-C57","v":268},{"$f":"D58+D58-D57","v":5.4},{"$f":"E58+E58-E57","v":{"v":9.32,"d":"9.3"}},110,{"v":0.15,"d":"15%"},119,-1,{"v":3.7,"d":"3.70"},{"$f":"K58+K58-K57","v":379},596,186,0,90,28,{"$f":"Q58+Q58-Q57","v":394},{"v":1,"d":"100%"},80,4.4,4.4,0.6,1.9,26.7,null,{"v":377.3,"d":"377"}]
[null,"Grünland, 1. Nutzung, BW intensiv, gut",180,{"v":6.66,"d":"6.7"},{"v":10.99,"d":"11.0"},157,{"v":0.1,"d":"10%"},{"$f":"ROUND((11.93-(6.82*G60))*E60+1.03*G60*F60,0)","v":140},"+3",{"v":2.7,"d":"2.70"},238,425,{"$f":"IF(AND(S60<>\"\",F60<>\"\",L60<>\"\",P60<>\"\"),1000-F60-L60-P60-S60,\"Fehler\")","v":302},0,189,29,208,{"v":0.75,"d":"75%"},87,6.9,4.3,0.7,2.1,23.9,null,{"v":338.09999999999997,"d":"338"}]
[null,"Grünland, 1. Nutzung, BW intensiv, mittel",240,6.2,10.4,168,{"v":0.15,"d":"15%"},139,{"$f":"IF((F61-H61)/6.25<0,ROUND((F61-H61)/6.25,0),\"+\"&ROUND(((F61-H61)/6.25),0))","v":"+5"},{"$f":"ROUND(L61*0.006+0.15,1)","v":{"v":3.2,"d":"3.20"}},294,502,{"$f":"IF(AND(S61<>\"\",F61<>\"\",L61<>\"\",P61<>\"\"),1000-F61-L61-P61-S61,\"Fehler\")","v":221},0,{"$f":"(O60+O62)/2","v":158},27,237,{"v":0.8,"d":"80%"},82,6.8,2.9,0.6,{"v":2,"d":"2.0"},{"v":25,"d":"25.0"},null,{"v":353.5,"d":"354"}]
[null,"Grünland, 1. Nutzung, BW intensiv, gering",270,{"v":5.97,"d":"6.0"},{"v":10.03,"d":"10.0"},132,{"v":0.15,"d":"15%"},130,"+0",{"v":3.6,"d":"3.60"},296,{"$f":"L61+L61-L60","v":579},184,0,127,27,229,{"v":1,"d":"100%"},78,{"v":7,"d":"7.0"},2.1,0.5,{"v":2,"d":"2.0"},27.4,null,{"v":387.09999999999997,"d":"387"}]
[null,"Grünland, 2. Nutzung, BW intensiv, gut",180,{"v":6.49,"d":"6.5"},10.7,201,{"v":0.1,"d":"10%"},{"$f":"ROUND((11.93-(6.82*G63))*E63+1.03*G63*F63,0)","v":141},"+10",{"v":2.5,"d":"2.50"},261,387,{"$f":"IF(AND(S63<>\"\",F63<>\"\",L63<>\"\",P63<>\"\"),1000-F63-L63-P63-S63,\"Fehler\")","v":253},0,62,35,183,{"v":0.75,"d":"75%"},124,6.2,3.8,0.5,1.9,28.8,null,{"v":406.7,"d":"407"}]
[null,"Grünland, 2. Nutzung, BW intensiv, mittel",240,6.1,10.2,162,{"v":0.15,"d":"15%"},136,{"$f":"IF((F64-H64)/6.25<0,ROUND((F64-H64)/6.25,0),\"+\"&ROUND(((F64-H64)/6.25),0))","v":"+4"},{"$f":"ROUND(L64*0.006+0.15,1)","v":{"v":2.9,"d":"2.90"}},294,450,{"$f":"IF(AND(S64<>\"\",F64<>\"\",L64<>\"\",P64<>\"\"),1000-F64-L64-P64-S64,\"Fehler\")","v":248},0,62,30,226,{"v":0.8,"d":"80%"},110,6.2,3.8,0.5,1.9,28.8,null,{"v":406.7,"d":"407"}]
[null,"Grünland, 2. Nutzung, BW intensiv, gering",270,5.9,9.9,164,{"v":0.15,"d":"15%"},133,"+5",{"v":3,"d":"3.00"},300,479,211,0,62,29,234,{"v":1,"d":"100%"},117,6.2,3.8,0.5,1.9,28.8,null,{"v":406.7,"d":"407"}]
[null,"Grünland, Folgenutzung, BW intensiv, gut",230,{"$f":"(5.74+6.41)/2","v":{"v":6.075,"d":"6.1"}},{"$f":"(10.58+9.72)/2","v":{"v":10.15,"d":"10.2"}},{"$f":"(177+148)/2","v":{"v":162.5,"d":"163"}},{"v":0.1,"d":"10%"},{"$f":"ROUND((11.93-(6.82*G66))*E66+1.03*G66*F66,0)","v":131},"+5",{"v":3,"d":"3.00"},{"$f":"(255+316)/2","v":{"v":285.5,"d":"286"}},{"$f":"(417+522)/2","v":{"v":469.5,"d":"470"}},{"$f":"IF(AND(S66<>\"\",F66<>\"\",L66<>\"\",P66<>\"\"),1000-F66-L66-P66-S66,\"Fehler\")","v":{"v":224.5,"d":"225"}},0,75,{"$f":"(31+33)/2","v":32},{"$f":"(217+279)/2","v":248},{"v":0.75,"d":"75%"},{"$f":"(131+92)/2","v":111.5},{"$f":"(8.8+8.1)/2","v":{"v":8.45,"d":"8.5"}},{"$f":"(5.1+5)/2","v":{"v":5.05,"d":"5.1"}},{"$f":"(1.4+1.2)/2","v":{"v":1.2999999999999998,"d":"1.3"}},{"$f":"(2.3+2.5)/2","v":2.4},{"$f":"(31.2+19.8)/2","v":25.5},null,{"v":360.5,"d":"361"}]
[null,"Grünland, Folgenutzung, BW intensiv, gering",250,{"$f":"(5.23+5.74)/2","v":{"v":5.485,"d":"5.5"}},{"$f":"(9.65+9)/2","v":{"v":9.325,"d":"9.3"}},{"$f":"(155+128)/2","v":{"v":141.5,"d":"142"}},{"v":0.15,"d":"15%"},124,{"$f":"IF((F67-H67)/6.25<0,ROUND((F67-H67)/6.25,0),\"+\"&ROUND(((F67-H67)/6.25),0))","v":"+3"},{"$f":"ROUND(L67*0.006+0.15,1)","v":{"v":3.1,"d":"3.10"}},{"$f":"(277+395)/2","v":336},{"$f":"(425+559)/2","v":492},{"$f":"IF(AND(S67<>\"\",F67<>\"\",L67<>\"\",P67<>\"\"),1000-F67-L67-P67-S67,\"Fehler\")","v":215},0,75,{"$f":"(21+35)/2","v":28},{"$f":"(248+335)/2","v":291.5},{"v":0.8,"d":"80%"},{"$f":"(81+166)/2","v":123.5},{"$f":"(7.8+9.2)/2","v":8.5},{"$f":"(5.5+4.9)/2","v":5.2},{"$f":"(1.2+1.5)/2","v":{"v":1.35,"d":"1.4"}},{"$f":"(2.5+3.8)/2","v":{"v":3.15,"d":"3.2"}},{"$f":"(26.8+12.1)/2","v":{"v":19.45,"d":"19.5"}},null,{"v":275.8,"d":"276"}]
[null,"Karotten",120,7.7,{"v":12.15,"d":"12.2"},100,{"v":0.15,"d":"15%"},{"$f":"ROUND((11.93-(6.82*G68))*E68+1.03*G68*F68,0)","v":148},{"$f":"IF((F68-H68)/6.25<0,ROUND((F68-H68)/6.25,0),\"+\"&ROUND(((F68-H68)/6.25),0))","v":-8},{"$f":"ROUND((+Q68*0.0125-0.2)*0.95,1)","v":{"v":0.9,"d":"0.90"}},95,96,{"$f":"IF(AND(S68<>\"\",F68<>\"\",L68<>\"\",P68<>\"\"),1000-F68-L68-P68-S68,\"Fehler\")","v":694},0,500,15,95,{"v":0.5,"d":"50%"},95,3.5,3.5,3.5,1.5,{"v":26,"d":"26.0"},"...","...",null,""]
[null,"Kartoffeln",220,8.5,13.1,96,{"v":0.35,"d":"35%"},{"$f":"ROUND((11.93-(6.82*G69))*E69+1.03*G69*F69,0)","v":160},-10,{"v":0.7,"d":"0.70"},45,75,764,710,30,5,27,0,60,{"$f":"0.1/0.22","v":{"v":0.4545454545454546,"d":"0.5"}},{"$f":"0.6/0.22","v":{"v":2.727272727272727,"d":"2.7"}},{"$f":"0.1/0.22","v":{"v":0.4545454545454546,"d":"0.5"}},{"$f":"0.2/0.22","v":{"v":0.9090909090909092,"d":"0.9"}},{"$f":"4.7/0.22","v":{"v":21.363636363636363,"d":"21.4"}},"...",365,null,"",{"$f":"+Q69","v":27},{"$f":"IF(M69=0,0.0001,M69)","v":764},{"v":0.1,"d":"10%"},{"$f":"+AD69*AE69","v":76.4},{"$f":"+O69","v":30},{"$f":"0.9-1.3*AE69","v":{"v":0.77,"d":"0.770"}}]
[null,"Kleegras 1. Aufwuchs - vor der Knospe",150,{"v":6.73,"d":"6.7"},{"v":11.05,"d":"11.1"},230,{"v":0.15,"d":"15%"},156,"+12",{"$f":"ROUND((+Q70*0.0125-0.2)*0.95,1)","v":{"v":2,"d":"2.00"}},{"$f":"Q70*1.2","v":222},{"$f":"Q70*1.9","v":{"v":351.5,"d":"352"}},{"v":278.5,"d":"279"},0,80,35,185,{"v":0.5,"d":"50%"},105,{"v":13,"d":"13.0"},4.5,0.3,2.4,{"v":36,"d":"36.0"},"...",500,null,""]
[null,"Kleegras 1. Aufwuchs - in der Knospe",160,{"v":6.37,"d":"6.4"},{"v":10.58,"d":"10.6"},215,{"v":0.15,"d":"15%"},149,{"$f":"IF((F71-H71)/6.25<0,ROUND((F71-H71)/6.25,0),\"+\"&ROUND(((F71-H71)/6.25),0))","v":"+11"},{"v":2.4,"d":"2.40"},270,435,220,0,80,30,220,{"v":0.6,"d":"60%"},100,{"v":10,"d":"10.0"},4.4,0.5,2.3,{"v":35,"d":"35.0"},"...",500,null,""]
[null,"Kleegras, Folgeaufwuchs - in der Knospe",170,5.9,{"v":9.94,"d":"9.9"},205,{"v":0.15,"d":"15%"},140,"+10",{"v":2.7,"d":"2.70"},{"$f":"Q72*1.2","v":288},{"$f":"Q72*1.9","v":456},204,0,70,30,240,{"v":0.6,"d":"60%"},105,{"$f":"2.4/0.21","v":{"v":11.428571428571429,"d":"11.4"}},{"$f":"0.9/0.21","v":{"v":4.285714285714286,"d":"4.3"}},{"$f":"0.15/0.21","v":{"v":0.7142857142857143,"d":"0.7"}},{"$f":"0.5/0.21","v":{"v":2.380952380952381,"d":"2.4"}},{"$f":"6.7/0.21","v":{"v":31.904761904761905,"d":"31.9"}},"...",500,null,""]
[null,"Kleegras, Folgeaufwuchs - Beginn der Blüte",180,{"v":5.47,"d":"5.5"},{"v":9.33,"d":"9.3"},170,{"v":0.2,"d":"20%"},134,"+6",{"v":2.9,"d":"2.90"},305,520,175,0,70,30,260,{"v":0.8,"d":"80%"},105,{"v":8,"d":"8.0"},{"v":4,"d":"4.0"},0.3,{"v":2,"d":"2.0"},{"v":35,"d":"35.0"},"...","...",null,""]
[null,"Luzerne, Beginn Knospenbildung",170,6.2,10.4,240,{"v":0.15,"d":"15%"},151,"+14",{"v":2.3,"d":"2.30"},285,340,285,0,15,30,210,{"v":0.75,"d":"75%"},105,{"v":18,"d":"18.0"},{"v":3,"d":"3.0"},0.5,3.2,{"v":30,"d":"30.0"},"...","...",null,""]
[null,"Luzerne, Beginn Blüte",200,{"v":5.45,"d":"5.5"},{"v":9.31,"d":"9.3"},190,{"v":0.2,"d":"20%"},138,"+8",{"v":3.1,"d":"3.10"},330,385,290,0,25,30,275,{"v":0.75,"d":"75%"},105,{"v":20,"d":"20.0"},2.8,{"v":1,"d":"1.0"},2.7,{"v":26,"d":"26.0"},"...","...",null,""]
[null,"Mais",358,{"v":7.06,"d":"7.1"},{"v":11.57,"d":"11.6"},63,{"v":0.15,"d":"15%"},{"$f":"ROUND((11.93-(6.82*G76))*E76+1.03*G76*F76,0)","v":136},{"$f":"IF((F76-H76)/6.25<0,ROUND((F76-H76)/6.25,0),\"+\"&ROUND(((F76-H76)/6.25),0))","v":-12},{"$f":"ROUND((+Q76*0.0125-0.2)*0.95,1)","v":{"v":1.7,"d":"1.70"}},180,306,{"$f":"IF(AND(S76<>\"\",F76<>\"\",L76<>\"\",P76<>\"\"),1000-F76-L76-P76-S76,\"Fehler\")","v":564},357,110,32,157,{"v":0.75,"d":"75%"},35,2.1,2.6,0.1,1.4,9.2]
[null,"Raps, v.d. Blüte",120,{"v":6.76,"d":"6.8"},{"v":11.02,"d":"11.0"},210,{"v":0.15,"d":"15%"},153,"+9",{"v":1.4,"d":"1.40"},155,235,375,0,110,35,130,{"v":0.5,"d":"50%"},145,{"v":17,"d":"17.0"},4.5,1.3,2.6,{"v":32,"d":"32.0"},"...",305,null,""]
[null,"Roggen, Schossen",220,{"v":6.94,"d":"6.9"},{"v":11.33,"d":"11.3"},185,{"v":0.15,"d":"15%"},152,"+5",{"v":2.5,"d":"2.50"},{"$f":"1.2*Q78","v":276},{"$f":"1.9*Q78","v":437},238,0,120,40,230,{"v":0.75,"d":"75%"},100,7.5,6.6,{"v":1,"d":"1.0"},1.6,{"v":28,"d":"28.0"},"...","...",null,""]
[null,"Rübenblatt, sauber",160,6.5,10.5,160,{"v":0.15,"d":"15%"},139,"+3",{"v":1.5,"d":"1.50"},125,310,345,0,220,20,110,{"v":0.5,"d":"50%"},165,{"$f":"2.1/0.16","v":{"v":13.125,"d":"13.1"}},{"$f":"0.4/0.16","v":2.5},{"$f":"0.9/0.16","v":{"v":5.625,"d":"5.6"}},{"$f":"0.7/0.16","v":{"v":4.375,"d":"4.4"}},{"$f":"5/0.16","v":{"v":31.25,"d":"31.3"}},"...","...",null,""]
[null,"Schlempe, Weizen",60,{"v":7.92,"d":"7.9"},12.9,360,{"v":0.3,"d":"30%"},239,"+19",{"v":0,"d":"0.00"},130,430,90,175,20,70,100,{"v":0,"d":"0%"},50,3.5,5.3,3.1,2.4,{"v":8,"d":"8.0"},"...","...",null,"",{"$f":"+Q80","v":100},{"$f":"IF(M80=0,0.0001,M80)","v":90},{"v":0.1,"d":"10%"},{"$f":"+AD80*AE80","v":9},{"$f":"+O80","v":20},{"$f":"0.9-1.3*AE80","v":{"v":0.77,"d":"0.770"}}]
[null,"Schlempe, Kartoffel",60,7.5,{"v":11.98,"d":"12.0"},308,{"v":0.3,"d":"30%"},214,"+15",{"v":0,"d":"0.00"},70,90,452,27,0,15,70,{"v":0,"d":"0%"},135,2.8,7.3,0.6,0.5,{"v":55,"d":"55.0"},"...","...",null,"",{"$f":"+Q81","v":70},{"$f":"IF(M81=0,0.0001,M81)","v":452},{"v":0.1,"d":"10%"},{"$f":"+AD81*AE81","v":45.2},{"$f":"+O81","v":0},{"$f":"0.9-1.3*AE81","v":{"v":0.77,"d":"0.770"}}]
[null,"Zuckerrüben, sauber",230,{"v":8,"d":"8.0"},12.6,60,{"v":0.2,"d":"20%"},145,-14,{"v":0.8,"d":"0.80"},250,110,760,0,695,20,52,{"v":0,"d":"0%"},50,2.6,1.7,0.9,1.7,{"v":15,"d":"15.0"},"...",100,null,""]
[]
["Silagen",null,1E-4,1E-4,1E-4,1E-4,1E-4,1E-4,1E-4,1E-4,1E-4,1E-4,1E-4,1E-4,1E-4,1E-4,1E-4,1E-4,1E-4,1E-4,1E-4,1E-4,1E-4,1E-4,1E-4]
[null,"Biertrebersilage",230,{"v":6.72,"d":"6.7"},{"v":11.26,"d":"11.3"},235,{"v":0.4,"d":"40%"},{"$f":"ROUND((11.93-(6.82*G85))*E85+1.03*G85*F85,0)","v":200},{"$f":"IF((F85-H85)/6.25<0,ROUND((F85-H85)/6.25,0),\"+\"&ROUND(((F85-H85)/6.25),0))","v":"+6"},1.05,299,581,57,20,6,83,215,{"v":0.25,"d":"25%"},45,4.3,8.5,0.2,2.1,2.2,"...",-70,null,{"$f":"IF(COUNTA(B85:Y85)<21,\"x\",\"\")","v":""},{"$f":"+Q85","v":215},{"$f":"IF(N85=0,0.0001,N85)","v":20},{"v":0.1,"d":"10%"},{"$f":"+AD85*AE85","v":2},{"$f":"+O85","v":6},{"$f":"0.9-1.3*AE85","v":{"v":0.77,"d":"0.770"}}]
[null,"CCM",600,{"v":7.99,"d":"8.0"},{"v":12.78,"d":"12.8"},100,{"v":0.35,"d":"35%"},158,{"$f":"IF((F86-H86)/6.25<0,ROUND((F86-H86)/6.25,0),\"+\"&ROUND(((F86-H86)/6.25),0))","v":-9},{"$f":"ROUND(0.321+0.00098*AC86+0.00025*AF86-(0.00112*(AG86+AH86*(AD86-AF86))),2)","v":0.17},{"$f":"Q86*1.16","v":{"v":63.8,"d":"64"}},{"$f":"Q86*3","v":165},{"$f":"IF(AND(S86<>\"\",F86<>\"\",L86<>\"\",P86<>\"\"),1000-F86-L86-P86-S86,\"Fehler\")","v":670},630,4,45,55,{"v":0,"d":"0%"},20,0.4,3.5,0.2,1.3,{"v":4,"d":"4.0"},"...",-60,null,"",{"$f":"+Q86","v":55},{"$f":"IF(N86=0,0.0001,N86)","v":630},{"v":0.3,"d":"30%"},{"$f":"+AD86*AE86","v":189},{"$f":"+O86","v":4},{"$f":"0.9-1.3*AE86","v":{"v":0.51,"d":"0.510"}}]
[null,"GPS, Ackerbohne",350,{"v":5.69,"d":"5.7"},{"v":9.67,"d":"9.7"},180,{"v":0.15,"d":"15%"},133,{"$f":"IF((F87-H87)/6.25<0,ROUND((F87-H87)/6.25,0),\"+\"&ROUND(((F87-H87)/6.25),0))","v":"+8"},{"$f":"L87*0.006-0.57","v":{"v":3.1260000000000003,"d":"3.13"}},{"$f":"Q87*1.3","v":364},{"$f":"Q87*2.2","v":616},104,120,30,20,280,{"v":1,"d":"100%"},80,{"v":10,"d":"10.0"},3.6,{"v":2,"d":"2.0"},3.3,{"v":20,"d":"20.0"},"...","...",null,"",{"$f":"+Q87","v":280},{"$f":"IF(N87=0,0.0001,N87)","v":120},{"v":0.1,"d":"10%"},{"$f":"+AD87*AE87","v":12},{"$f":"+O87","v":30},{"$f":"0.9-1.3*AE87","v":{"v":0.77,"d":"0.770"}}]
[null,"GPS, Gerste, BW gut",430,5.8,9.9,96,{"v":0.2,"d":"20%"},124,{"$f":"IF((F88-H88)/6.25<0,ROUND((F88-H88)/6.25,0),\"+\"&ROUND(((F88-H88)/6.25),0))","v":-4},{"$f":"L88*0.006-0.57","v":{"v":1.9380000000000002,"d":"1.94"}},233,418,418,263,30,23,203,{"v":1,"d":"100%"},45,3.2,2.4,0.2,1.3,14.6,"...",120,null,"",{"$f":"+Q88","v":203},{"$f":"IF(N88=0,0.0001,N88)","v":263},{"v":0.1,"d":"10%"},{"$f":"+AD88*AE88","v":26.3},{"$f":"+O88","v":30},{"$f":"0.9-1.3*AE88","v":{"v":0.77,"d":"0.770"}}]
[null,"GPS, Gerste, BW gering",370,5.2,{"v":9,"d":"9.0"},75,{"v":0.2,"d":"20%"},110,{"$f":"IF((F89-H89)/6.25<0,ROUND((F89-H89)/6.25,0),\"+\"&ROUND(((F89-H89)/6.25),0))","v":-6},2.49,305,510,{"$f":"IF(AND(S89<>\"\",F89<>\"\",L89<>\"\",P89<>\"\"),1000-F89-L89-P89-S89,\"Fehler\")","v":325},230,30,20,264,{"v":1,"d":"100%"},70,3.2,2.4,0.2,1.3,14.6,"...",120]
[null,"GPS, Hafer, BW",410,4.9,8.5,106,{"v":0.2,"d":"20%"},116,-2,{"v":3.2100000000000004,"d":"3.21"},365,630,149,240,30,25,325,{"v":1,"d":"100%"},90,5.3,5.7,0.2,2.2,{"v":20,"d":"20.0"},"...",120]
[null,"GPS, Weizen, BW",440,5.6,9.6,92,{"v":0.2,"d":"20%"},119,-4,{"v":2.0220000000000002,"d":"2.02"},262,432,406,249,2,20,220,{"v":1,"d":"100%"},50,2.2,{"v":3,"d":"3.0"},0.1,1.1,11.9,"...",120]
[null,"Grassilage, 1. S, BW extensiv, gut",362,{"v":6.42,"d":"6.4"},{"v":10.66,"d":"10.7"},157,{"v":0.15,"d":"15%"},{"$f":"ROUND((11.93-(6.82*G92))*E92+1.03*G92*F92,0)","v":141},"+3",{"$f":"ROUND(L92*0.006+0.15,1)","v":{"v":2.6,"d":"2.60"}},263,408,303,0,66,37,222,{"v":1,"d":"100%"},95,7.4,3.6,0.4,2.2,27.6,"...",{"$f":"14*X92+3.5","v":{"v":389.90000000000003,"d":"390"}}]
[null,"Grassilage, 1. S, BW extensiv, mittel",344,{"v":6,"d":"6.0"},{"v":10.07,"d":"10.1"},145,{"v":0.15,"d":"15%"},132,"+2",{"v":2.8,"d":"2.80"},288,445,275,0,48,36,244,{"v":1,"d":"100%"},99,7.6,3.5,0.3,2.1,26.9,"...",{"$f":"14*X93+3.5","v":{"v":380.09999999999997,"d":"380"}}]
[null,"Grassilage, 1. S, BW extensiv, gering",253,{"v":5.54,"d":"5.5"},9.4,130,{"v":0.15,"d":"15%"},123,"+1",{"v":3,"d":"3.00"},318,479,253,0,39,32,269,{"v":1,"d":"100%"},106,7.8,3.1,0.4,2.1,23.6,"...",{"v":333.90000000000003,"d":"334"}]
[null,"Grassilage, 2. S, BW extensiv, gut",418,{"v":6.22,"d":"6.2"},{"v":10.37,"d":"10.4"},156,{"v":0.15,"d":"15%"},137,{"$f":"IF((F95-H95)/6.25<0,ROUND((F95-H95)/6.25,0),\"+\"&ROUND(((F95-H95)/6.25),0))","v":"+3"},{"$f":"ROUND(L95*0.006+0.15,1)","v":{"v":2.7,"d":"2.70"}},275,432,{"$f":"IF(AND(S95<>\"\",F95<>\"\",L95<>\"\",P95<>\"\"),1000-F95-L95-P95-S95,\"Fehler\")","v":275},0,72,37,228,{"v":1,"d":"100%"},100,9.2,3.8,0.5,2.7,26.3,"...",{"v":371.7,"d":"372"}]
[null,"Grassilage, 2. S, BW extensiv, mittel",413,{"v":5.82,"d":"5.8"},9.8,140,{"v":0.15,"d":"15%"},129,"+2",{"v":2.8,"d":"2.80"},292,444,275,0,59,34,240,{"v":1,"d":"100%"},107,9.9,3.5,0.5,2.7,{"v":25,"d":"25.0"},"...",{"v":353.5,"d":"354"}]
[null,"Grassilage, 2. S, BW extensiv, gering",405,{"v":5.41,"d":"5.4"},9.2,135,{"v":0.15,"d":"15%"},121,"+2",{"v":3,"d":"3.00"},319,476,245,0,45,31,262,{"v":1,"d":"100%"},113,10.4,3.3,0.4,2.7,22.1,"...",{"v":312.90000000000003,"d":"313"}]
[null,"Grassilage, 3. S, BW extensiv, gut",396,{"v":6.13,"d":"6.1"},{"v":10.24,"d":"10.2"},161,{"v":0.15,"d":"15%"},137,{"$f":"IF((F98-H98)/6.25<0,ROUND((F98-H98)/6.25,0),\"+\"&ROUND(((F98-H98)/6.25),0))","v":"+4"},{"$f":"ROUND(L98*0.006+0.15,1)","v":{"v":2.6,"d":"2.60"}},264,404,{"$f":"IF(AND(S98<>\"\",F98<>\"\",L98<>\"\",P98<>\"\"),1000-F98-L98-P98-S98,\"Fehler\")","v":287},0,61,37,210,{"v":1,"d":"100%"},111,{"v":12,"d":"12.0"},3.9,0.6,{"v":3,"d":"3.0"},25.4,"...",{"v":359.09999999999997,"d":"359"}]
[null,"Grassilage, 3. S, BW extensiv, mittel",385,{"v":5.79,"d":"5.8"},{"v":9.74,"d":"9.7"},147,{"v":0.15,"d":"15%"},129,"+3",{"v":2.7,"d":"2.70"},289,423,277,0,44,35,231,{"v":1,"d":"100%"},118,11.3,3.8,0.6,2.8,25.3,"...",{"v":357.7,"d":"358"}]
[null,"Grassilage, 3. S, BW extensiv, gering",352,{"v":5.45,"d":"5.5"},{"v":9.22,"d":"9.2"},142,{"v":0.15,"d":"15%"},123,"+3",{"v":2.8,"d":"2.80"},303,449,234,0,27,34,241,{"v":1,"d":"100%"},141,11.8,3.5,0.4,2.8,25.1,"...",{"v":354.90000000000003,"d":"355"}]
[null,"Grassilage, 1. S, BW intensiv, gut",356,{"v":6.61,"d":"6.6"},{"v":10.91,"d":"10.9"},164,{"v":0.15,"d":"15%"},144,"+3",{"v":2.5,"d":"2.50"},246,396,306,0,76,38,212,{"v":1,"d":"100%"},96,6.8,3.6,0.6,2.1,28.3,0.06,{"v":399.7,"d":"400"}]
[null,"Grassilage, 1. S, BW intensiv, mittel",333,{"v":6.18,"d":"6.2"},{"v":10.32,"d":"10.3"},155,{"v":0.15,"d":"15%"},137,"+3",{"v":2.7,"d":"2.70"},274,429,278,0,46,37,235,{"v":1,"d":"100%"},101,6.9,3.6,0.5,2.1,27.8,0.05,{"v":392.7,"d":"393"}]
[null,"Grassilage, 1. S, BW intensiv, gering",324,{"v":5.77,"d":"5.8"},{"v":9.74,"d":"9.7"},141,{"v":0.15,"d":"15%"},128,"+2",{"v":2.9,"d":"2.90"},298,454,262,0,38,35,252,{"v":1,"d":"100%"},108,7.1,3.4,0.4,2.1,26.6,0.05,{"v":375.90000000000003,"d":"376"}]
[null,"Grassilage, 2. S, BW intensiv, gut",401,{"v":6.36,"d":"6.4"},{"v":10.56,"d":"10.6"},161,{"v":0.15,"d":"15%"},140,{"$f":"IF((F104-H104)/6.25<0,ROUND((F104-H104)/6.25,0),\"+\"&ROUND(((F104-H104)/6.25),0))","v":"+3"},{"$f":"ROUND(L104*0.006+0.15,1)","v":{"v":2.6,"d":"2.60"}},263,413,{"$f":"IF(AND(S104<>\"\",F104<>\"\",L104<>\"\",P104<>\"\"),1000-F104-L104-P104-S104,\"Fehler\")","v":288},0,73,37,220,{"v":1,"d":"100%"},101,7.9,3.8,0.9,2.6,26.5,0.07,{"v":374.5,"d":"375"}]
[null,"Grassilage, 2. S, BW intensiv, mittel",385,{"v":6.06,"d":"6.1"},{"v":10.14,"d":"10.1"},152,{"v":0.15,"d":"15%"},134,"+3",{"v":2.8,"d":"2.80"},279,434,275,0,59,36,234,{"v":1,"d":"100%"},103,8.4,3.6,0.7,2.6,26.1,0.07,{"v":368.90000000000003,"d":"369"}]
[null,"Grassilage, 2. S, BW intensiv, gering",380,{"v":5.73,"d":"5.7"},{"v":9.67,"d":"9.7"},142,{"v":0.15,"d":"15%"},127,"+2",{"v":2.9,"d":"2.90"},296,457,257,0,48,34,247,{"v":1,"d":"100%"},110,8.6,3.6,0.6,2.6,24.7,0.07,{"v":349.3,"d":"349"}]
[null,"Grassilage, 3. S, BW intensiv, gut",405,{"v":6.28,"d":"6.3"},{"v":10.43,"d":"10.4"},168,{"v":0.15,"d":"15%"},{"$f":"ROUND((11.93-(6.82*G107))*E107+1.03*G107*F107,0)","v":140},{"$f":"IF((F107-H107)/6.25<0,ROUND((F107-H107)/6.25,0),\"+\"&ROUND(((F107-H107)/6.25),0))","v":"+4"},{"$f":"ROUND(L107*0.006+0.15,1)","v":{"v":2.6,"d":"2.60"}},262,415,{"$f":"IF(AND(S107<>\"\",F107<>\"\",L107<>\"\",P107<>\"\"),1000-F107-L107-P107-S107,\"Fehler\")","v":269},0,63,39,216,{"v":1,"d":"100%"},109,8.3,3.8,0.7,2.8,27.1,0.08,{"v":382.90000000000003,"d":"383"}]
[null,"Grassilage, 3. S, BW intensiv, mittel",375,{"v":5.96,"d":"6.0"},{"v":10,"d":"10.0"},163,{"v":0.15,"d":"15%"},134,"+5",{"v":2.7,"d":"2.70"},279,425,263,0,43,38,227,{"v":1,"d":"100%"},111,9.6,{"v":4,"d":"4.0"},0.7,{"v":3,"d":"3.0"},26.1,0.07,{"v":368.90000000000003,"d":"369"}]
[null,"Grassilage, 3. S, BW intensiv, gering",361,{"v":5.59,"d":"5.6"},{"v":9.45,"d":"9.5"},153,{"v":0.15,"d":"15%"},127,"+4",{"v":2.8,"d":"2.80"},298,443,247,0,33,35,240,{"v":1,"d":"100%"},122,9.7,3.8,0.6,3.1,24.6,0.07,{"v":347.90000000000003,"d":"348"}]
[null,"Grassilage, 4. S, BW intensiv, gut",379,{"v":6.39,"d":"6.4"},{"v":10.57,"d":"10.6"},176,{"v":0.15,"d":"15%"},{"$f":"ROUND((11.93-(6.82*G110))*E110+1.03*G110*F110,0)","v":142},{"$f":"IF((F110-H110)/6.25<0,ROUND((F110-H110)/6.25,0),\"+\"&ROUND(((F110-H110)/6.25),0))","v":"+5"},{"$f":"ROUND(L110*0.006+0.15,1)","v":{"v":2.5,"d":"2.50"}},247,386,{"$f":"IF(AND(S110<>\"\",F110<>\"\",L110<>\"\",P110<>\"\"),1000-F110-L110-P110-S110,\"Fehler\")","v":277},0,55,39,200,{"v":1,"d":"100%"},122,9.1,4.4,0.6,2.9,29.6,0.07,{"v":417.90000000000003,"d":"418"}]
[null,"Grassilage, 4. S, BW intensiv, mittel",373,{"v":6.08,"d":"6.1"},{"v":10.13,"d":"10.1"},170,{"v":0.15,"d":"15%"},137,"+5",{"v":2.6,"d":"2.60"},266,406,257,0,44,38,216,{"v":1,"d":"100%"},129,8.9,4.1,0.7,{"v":3,"d":"3.0"},25.8,0.07,{"v":364.7,"d":"365"}]
[null,"Grassilage, 4. S, BW intensiv, gering",337,{"v":5.78,"d":"5.8"},{"v":9.66,"d":"9.7"},173,{"v":0.15,"d":"15%"},132,"+7",{"v":2.6,"d":"2.60"},264,415,216,0,28,38,211,{"v":1,"d":"100%"},158,7.8,4.2,0.9,3.1,28.9,0.07,{"v":408.09999999999997,"d":"408"}]
[null,"Hafer, grün",190,6.3,10.4,115,{"v":0.15,"d":"15%"},130,{"$f":"IF((F113-H113)/6.25<0,ROUND((F113-H113)/6.25,0),\"+\"&ROUND(((F113-H113)/6.25),0))","v":-2},{"$f":"ROUND(L113*0.006+0.15,1)","v":{"v":3.3,"d":"3.30"}},305,525,{"$f":"IF(AND(S113<>\"\",F113<>\"\",L113<>\"\",P113<>\"\"),1000-F113-L113-P113-S113,\"Fehler\")","v":169},0,2,40,260,{"v":0.8,"d":"80%"},151,5.7,{"v":4,"d":"4.0"},{"v":1,"d":"1.0"},{"v":2,"d":"2.0"},{"v":22,"d":"22.0"},"...","..."]
[null,"Hirse",280,6.2,10.4,98,{"v":0.2,"d":"20%"},110,{"$f":"IF((F114-H114)/6.25<0,ROUND((F114-H114)/6.25,0),\"+\"&ROUND(((F114-H114)/6.25),0))","v":-2},{"$f":"ROUND(L114*0.006+0.15,1)","v":{"v":2.4,"d":"2.40"}},240,380,455,215,60,25,200,{"v":0.8,"d":"80%"},45,{"$nulls":5},"...","..."]
[null,"Kartoffelpülpe",180,{"v":7.08,"d":"7.1"},{"v":11.46,"d":"11.5"},49,{"v":0.25,"d":"25%"},{"$f":"ROUND((11.93-(6.82*G115))*E115+1.03*G115*F115,0)","v":130},{"$f":"IF((F115-H115)/6.25<0,ROUND((F115-H115)/6.25,0),\"+\"&ROUND(((F115-H115)/6.25),0))","v":-13},{"v":0.7,"d":"0.70"},315,365,546,380,15,5,208,{"v":0,"d":"0%"},35,0.7,2.7,0.1,0.7,{"v":22,"d":"22.0"},"...","...",null,"",{"$f":"+Q115","v":208},{"$f":"IF(N115=0,0.0001,N115)","v":380},{"v":0.1,"d":"10%"},{"$f":"+AD115*AE115","v":38},{"$f":"+O115","v":15},{"$f":"0.9-1.3*AE115","v":{"v":0.77,"d":"0.770"}}]
[null,"Kleegras, grasreich, 1. S., BW gut",317,{"v":6.39,"d":"6.4"},{"v":10.58,"d":"10.6"},151,{"v":0.15,"d":"15%"},138,"+2",{"$f":"ROUND(L116*0.006+0.15,1)","v":{"v":2.6,"d":"2.60"}},257,402,305,0,37,36,223,{"v":0.8,"d":"80%"},106,7.8,4.1,0.7,1.9,29.5,"...",520,null,""]
[null,"Kleegras, grasreich, 1. S., BW mittel",310,{"v":5.98,"d":"6.0"},{"v":10.04,"d":"10.0"},154,{"v":0.15,"d":"15%"},133,"+3",{"v":2.7,"d":"2.70"},289,418,295,0,27,32,244,{"v":0.8,"d":"80%"},101,{"v":10,"d":"10.0"},3.9,0.7,1.4,30.1,"...",550,null,""]
[null,"Kleegras, grasreich, 1. S., BW gering",303,{"v":5.35,"d":"5.4"},{"v":9.15,"d":"9.2"},139,{"v":0.15,"d":"15%"},121,"+3",{"v":3.2,"d":"3.20"},339,504,223,0,14,35,289,{"v":0.8,"d":"80%"},99,{"v":9,"d":"9.0"},{"v":3,"d":"3.0"},1.6,2.3,{"v":20,"d":"20.0"},"...",400,null,""]
[null,"Kleegras, grasreich, Folgeaufwuchs, BW gut",{"$f":"(413*3+398*1)/4","v":{"v":409.25,"d":"409"}},{"$f":"(6.12*3+5.9*1)/4","v":{"v":6.0649999999999995,"d":"6.1"}},{"$f":"(10.23*3+9.9*1)/4","v":{"v":10.1475,"d":"10.1"}},{"$f":"(126*3+163*1)/4","v":{"v":135.25,"d":"135"}},{"v":0.15,"d":"15%"},132,"+1",{"v":2.7,"d":"2.70"},{"$f":"(284*3+290*1)/4","v":{"v":285.5,"d":"286"}},{"$f":"(426*3+425*1)/4","v":{"v":425.75,"d":"426"}},{"v":301.25,"d":"301"},0,{"$f":"(49*3+56*1)/4","v":{"v":50.75,"d":"51"}},{"$f":"(35*3+35*1)/4","v":35},{"$f":"(243*3+248*1)/4","v":{"v":244.25,"d":"244"}},{"v":0.8,"d":"80%"},{"$f":"(102*3+105*1)/4","v":{"v":102.75,"d":"103"}},6.6,4.1,0.4,1.6,29.5,"...",445,null,""]
[null,"Kleegras, grasreich, Folgeaufwuchs, BW mittel",{"$f":"(397*12+342*4)/16","v":{"v":383.25,"d":"383"}},{"$f":"(5.79*12+5.73*4)/16","v":{"v":5.775,"d":"5.8"}},{"$f":"(9.75*12+9.66*4)/16","v":{"v":9.7275,"d":"9.7"}},{"$f":"(142*12+161*4)/16","v":{"v":146.75,"d":"147"}},{"v":0.15,"d":"15%"},{"$f":"ROUND((11.93-(6.82*G120))*E120+1.03*G120*F120,0)","v":129},{"$f":"IF((F120-H120)/6.25<0,ROUND((F120-H120)/6.25,0),\"+\"&ROUND(((F120-H120)/6.25),0))","v":"+3"},{"$f":"ROUND(L120*0.006+0.15,1)","v":{"v":2.9,"d":"2.90"}},{"$f":"(304*12+292*4)/16","v":301},{"$f":"(458*12+457*4)/16","v":{"v":457.75,"d":"458"}},{"$f":"IF(AND(S120<>\"\",F120<>\"\",L120<>\"\",P120<>\"\"),1000-F120-L120-P120-S120,\"Fehler\")","v":{"v":260.75,"d":"261"}},0,{"$f":"(54*12+26*4)/16","v":47},{"$f":"(31*12+36*4)/16","v":{"v":32.25,"d":"32"}},{"$f":"(262*12+246*4)/16","v":258},{"v":0.8,"d":"80%"},{"$f":"(98*12+116*4)/16","v":{"v":102.5,"d":"103"}},6.6,4.1,0.4,1.6,29.5,"...",445,null,""]
[null,"Kleegras, grasreich, Folgeaufwuchs, BW gering",{"$f":"(402*3+382*2)/5","v":394},{"$f":"(5.34*3+5.6*2)/5","v":{"v":5.444,"d":"5.4"}},{"$f":"(9.06*3+9.45*2)/5","v":{"v":9.216,"d":"9.2"}},{"$f":"(132*3+152*2)/5","v":140},{"v":0.15,"d":"15%"},122,"+3",{"v":3,"d":"3.00"},{"$f":"(341*3+301*2)/5","v":325},{"$f":"(478*3+458*2)/5","v":470},{"v":236.40000000000003,"d":"236"},0,{"$f":"(56*3+21*2)/5","v":42},{"$f":"(28*3+34*2)/5","v":{"v":30.4,"d":"30"}},{"$f":"(278*3+249*2)/5","v":{"v":266.4,"d":"266"}},{"v":0.8,"d":"80%"},{"$f":"(124*3+122*2)/5","v":{"v":123.2,"d":"123"}},11.8,4.5,0.5,2.4,34.6,null,580]
[null,"LKS",480,{"v":7.47,"d":"7.5"},{"v":12.09,"d":"12.1"},95,{"v":0.35,"d":"35%"},150,-9,{"$f":"ROUND(L122*0.006-0.57,1)","v":{"v":2,"d":"2.00"}},{"$f":"Q122*1.16","v":{"v":162.39999999999998,"d":"162"}},{"$f":"Q122*3","v":420},425,445,10,35,140,{"v":0.25,"d":"25%"},25,{"v":1,"d":"1.0"},2.5,0.3,1.2,{"v":6,"d":"6.0"},"...","...",null,"",{"$f":"+Q122","v":140},{"$f":"IF(N122=0,0.0001,N122)","v":445},{"v":0.3,"d":"30%"},{"$f":"+AD122*AE122","v":133.5},{"$f":"+O122","v":10},{"$f":"0.9-1.3*AE122","v":{"v":0.51,"d":"0.510"}}]
[null,"Luzerne, 1. S., BW gut",335,6.1,10.2,166,{"v":0.2,"d":"20%"},135,"+5",{"$f":"L123*0.006+0.15","v":{"v":2.634,"d":"2.63"}},308,414,285,0,36,32,247,{"v":0.8,"d":"80%"},103,{"v":12,"d":"12.0"},3.3,0.5,2.3,{"v":27,"d":"27.0"},"...",{"$f":"14*X123+3.5","v":{"v":381.5,"d":"382"}},null,""]
[null,"Luzerne, 1. S., BW mittel",360,5.7,9.5,176,{"v":0.2,"d":"20%"},131,{"$f":"IF((F124-H124)/6.25<0,ROUND((F124-H124)/6.25,0),\"+\"&ROUND(((F124-H124)/6.25),0))","v":"+7"},{"$f":"L124*0.006+0.15","v":{"v":2.424,"d":"2.42"}},318,379,{"$f":"IF(AND(S124<>\"\",F124<>\"\",L124<>\"\",P124<>\"\"),1000-F124-L124-P124-S124,\"Fehler\")","v":298},0,26,31,252,{"v":0.8,"d":"80%"},116,15.6,3.6,0.5,2.4,{"v":27,"d":"27.0"},"...",{"$f":"14*X124+3.5","v":{"v":381.5,"d":"382"}}]
[null,"Luzerne, 1. S., BW gering",450,5.1,8.8,160,{"v":0.2,"d":"20%"},122,"+6",{"$f":"L125*0.006+0.15","v":{"v":2.7119999999999997,"d":"2.71"}},357,427,273,0,49,25,275,{"v":0.8,"d":"80%"},115,12.8,3.4,0.5,2.1,{"v":25,"d":"25.0"},"...",{"v":353.5,"d":"354"}]
[null,"Luzerne, Folgeschnitt, BW gut",{"$f":"(377*4+334)/5","v":{"v":368.4,"d":"368"}},{"$f":"(5.55*4+5.67)/5","v":{"v":5.574,"d":"5.6"}},{"$f":"(9.41*4+9.57)/5","v":{"v":9.442,"d":"9.4"}},{"$f":"(174*4+196)/5","v":{"v":178.4,"d":"178"}},{"v":0.2,"d":"20%"},{"$f":"(129*4+128)/5","v":{"v":128.8,"d":"129"}},"+8",{"v":2.4636,"d":"2.46"},{"$f":"(313*4+309)/5","v":{"v":312.2,"d":"312"}},{"$f":"(395*4+348)/5","v":{"v":385.6,"d":"386"}},{"v":283.20000000000005,"d":"283"},0,{"$f":"(32*4+17)/5","v":29},{"$f":"(32*4+38)/5","v":{"v":33.2,"d":"33"}},{"$f":"(252*4+221)/5","v":245.8},{"v":0.8,"d":"80%"},{"$f":"(121*4+114)/5","v":{"v":119.6,"d":"120"}},{"v":11,"d":"11.0"},3.7,0.1,2.1,{"v":25,"d":"25.0"},"...",{"v":353.5,"d":"354"}]
[null,"Luzerne, Folgeschnitt, BW mittel",{"$f":"(382*4+436*3)/7","v":{"v":405.14285714285717,"d":"405"}},{"$f":"(5.22*4+5.27*3)/7","v":{"v":5.241428571428571,"d":"5.2"}},{"$f":"(8.93*4+9*3)/7","v":{"v":8.959999999999999,"d":"9.0"}},{"$f":"(176*4+204*3)/7","v":188},{"v":0.2,"d":"20%"},{"$f":"(126*4+127*3)/7","v":{"v":126.42857142857143,"d":"126"}},{"$f":"IF((F127-H127)/6.25<0,ROUND((F127-H127)/6.25,0),\"+\"&ROUND(((F127-H127)/6.25),0))","v":"+10"},{"$f":"L127*0.006+0.15","v":{"v":2.6434285714285712,"d":"2.64"}},{"$f":"(342*4+350*3)/7","v":{"v":345.42857142857144,"d":"345"}},{"$f":"(398*4+439*3)/7","v":{"v":415.57142857142856,"d":"416"}},{"$f":"IF(AND(S127<>\"\",F127<>\"\",L127<>\"\",P127<>\"\"),1000-F127-L127-P127-S127,\"Fehler\")","v":{"v":257.57142857142856,"d":"258"}},0,{"$f":"(27*4+45*3)/7","v":{"v":34.714285714285715,"d":"35"}},{"$f":"(32*4+22*3)/7","v":{"v":27.714285714285715,"d":"28"}},{"$f":"(267*4+298*3)/7","v":280.2857142857143},{"v":0.8,"d":"80%"},{"$f":"(121*4+98*3)/7","v":{"v":111.14285714285714,"d":"111"}},14.4,2.9,0.3,2.3,{"v":25,"d":"25.0"},"...",{"v":353.5,"d":"354"}]
[null,"Luzerne, Folgeschnitt, BW gering",{"$f":"(406*3+312*3)/6","v":359},{"$f":"(4.87*3+5.1*3)/6","v":{"v":4.984999999999999,"d":"5.0"}},{"$f":"(8.37*3+8.8*3)/6","v":{"v":8.585,"d":"8.6"}},{"$f":"(166*3+191*3)/6","v":{"v":178.5,"d":"179"}},{"v":0.2,"d":"20%"},{"$f":"(118*3+123*3)/6","v":{"v":120.5,"d":"121"}},"+9",2.82,{"$f":"(371*3+334*3)/6","v":{"v":352.5,"d":"353"}},{"$f":"(474*3+416*3)/6","v":445},{"v":241.5,"d":"242"},0,{"$f":"(22*3+0*3)/6","v":11},{"$f":"(21*3+27*3)/6","v":24},{"$f":"(311*3+285*3)/6","v":298},{"v":0.8,"d":"80%"},{"$f":"(110*3+112*3)/6","v":111},{"v":17,"d":"17.0"},3.5,0.2,2.6,{"v":28,"d":"28.0"},"...",{"v":395.5,"d":"396"},null,""]
[null,"Luzerne-Gras-Gemenge, 1. S. BW gut",360,{"v":6.21,"d":"6.2"},10.3,176,{"v":0.2,"d":"20%"},141,{"$f":"IF((F129-H129)/6.25<0,ROUND((F129-H129)/6.25,0),\"+\"&ROUND(((F129-H129)/6.25),0))","v":"+6"},{"$f":"L129*0.006+0.15","v":2.37},296,370,{"$f":"IF(AND(S129<>\"\",F129<>\"\",L129<>\"\",P129<>\"\"),1000-F129-L129-P129-S129,\"Fehler\")","v":302},0,31,37,213,{"v":0.8,"d":"80%"},115,15.1,3.7,0.3,2.1,{"v":30,"d":"30.0"},"...",{"v":423.5,"d":"424"}]
[null,"Luzerne-Gras-Gemenge, 1. S. BW mittel",360,5.9,9.9,169,{"v":0.2,"d":"20%"},137,"+5",2.58,307,405,285,0,37,32,251,{"v":0.8,"d":"80%"},109,15.7,3.1,0.8,2.5,{"v":26,"d":"26.0"},"...",{"v":367.5,"d":"368"}]
[null,"Luzerne-Gras-Gemenge, 1. S. BW gering",310,5.5,{"v":9.31,"d":"9.3"},178,{"v":0.2,"d":"20%"},133,"+7",{"v":2.418,"d":"2.42"},305,378,284,0,10,35,248,{"v":0.8,"d":"80%"},125,14.6,3.9,0.2,1.8,{"v":31,"d":"31.0"},"...",{"v":437.5,"d":"438"}]
[null,"Luzerne-Gras-Gemenge, Folgeschnitt BW gut",450,{"v":5.86,"d":"5.9"},9.9,141,{"v":0.2,"d":"20%"},131,"+2",{"v":2.856,"d":"2.86"},298,451,274,0,61,31,246,{"v":0.8,"d":"80%"},103,10.2,{"v":3,"d":"3.0"},0.7,3.1,{"v":22,"d":"22.0"},"...",{"v":311.5,"d":"312"}]
[null,"Luzerne-Gras-Gemenge, Folgeschnitt BW mittel",{"$f":"(350*7+313*2)/9","v":{"v":341.77777777777777,"d":"342"}},{"$f":"(5.66*7+5.65313*2)/9","v":{"v":5.658473333333334,"d":"5.7"}},{"$f":"(9.59*7+9.5*2)/9","v":{"v":9.57,"d":"9.6"}},{"$f":"(171*7+164*2)/9","v":{"v":169.44444444444446,"d":"169"}},{"v":0.2,"d":"20%"},{"$f":"(136*7+132*2)/9","v":{"v":135.11111111111111,"d":"135"}},{"$f":"IF((F133-H133)/6.25<0,ROUND((F133-H133)/6.25,0),\"+\"&ROUND(((F133-H133)/6.25),0))","v":"+5"},{"$f":"L133*0.006+0.15","v":{"v":2.528,"d":"2.53"}},{"$f":"(316*7+322*2)/9","v":{"v":317.3333333333333,"d":"317"}},{"$f":"(377*7+464*2)/9","v":{"v":396.3333333333333,"d":"396"}},{"v":287.55555555555554,"d":"288"},0,{"$f":"(42*7+43*2)/9","v":{"v":42.22222222222222,"d":"42"}},{"$f":"(32*7+37*2)/9","v":{"v":33.111111111111114,"d":"33"}},{"$f":"(253*7+266*2)/9","v":255.88888888888889},{"v":0.8,"d":"80%"},{"$f":"(116*7+105*2)/9","v":{"v":113.55555555555556,"d":"114"}},{"$f":"(T132+T134)/2","v":{"v":13.475,"d":"13.5"}},{"$f":"(U132+U134)/2","v":{"v":3.275,"d":"3.3"}},{"v":0.575,"d":"0.6"},{"v":2.9749999999999996,"d":"3.0"},{"v":22.625,"d":"22.6"},"...",{"v":320.25,"d":"320"}]
[null,"Luzerne-Gras-Gemenge, Folgeschnitt BW gering",{"$f":"(374*2+399*2)/4","v":{"v":386.5,"d":"387"}},{"$f":"(5.19*2+5.25399*2)/4","v":{"v":5.221995,"d":"5.2"}},{"$f":"(8.92*2+9*2)/4","v":{"v":8.96,"d":"9.0"}},{"$f":"(161*2+176*2)/4","v":{"v":168.5,"d":"169"}},{"v":0.2,"d":"20%"},{"$f":"(121*2+127*2)/4","v":124},{"$f":"IF((F134-H134)/6.25<0,ROUND((F134-H134)/6.25,0),\"+\"&ROUND(((F134-H134)/6.25),0))","v":"+7"},{"$f":"L134*0.006+0.15","v":{"v":2.634,"d":"2.63"}},{"$f":"(335*2+336*2)/4","v":{"v":335.5,"d":"336"}},{"$f":"(397*2+431*2)/4","v":414},283,0,{"$f":"(16*2+35*2)/4","v":{"v":25.5,"d":"26"}},{"$f":"(31*2+27*2)/4","v":29},{"$f":"(260*2+280*2)/4","v":270},{"v":0.8,"d":"80%"},{"$f":"(117*2+94*2)/4","v":{"v":105.5,"d":"106"}},{"$f":"(18.4*2+15.1*2)/4","v":{"v":16.75,"d":"16.8"}},{"$f":"(3.7*2+3.4*2)/4","v":{"v":3.55,"d":"3.6"}},{"$f":"(0.7*2+0.2*2)/4","v":{"v":0.44999999999999996,"d":"0.5"}},{"$f":"(2.8*2+2.9*2)/4","v":{"v":2.8499999999999996,"d":"2.9"}},{"$f":"(22.4*2+24.1*2)/4","v":{"v":23.25,"d":"23.3"}},"...",329]
[null,"Maiskleberfutter",440,8.1,12.8,170,{"v":0.3,"d":"30%"},179,-1,{"$f":"ROUND(0.321+0.00098*AC135+0.00025*AF135-(0.00112*(AG135+AH135*(AD135-AF135))),2)","v":0.17},110,240,505,340,15,30,85,{"v":0,"d":"0%"},55,1.5,9.5,2.8,4.8,{"v":14,"d":"14.0"},"...",215,null,"",{"$f":"+Q135","v":85},{"$f":"IF(N135=0,0.0001,N135)","v":340},{"v":0.15,"d":"15%"},{"$f":"+AD135*AE135","v":51},{"$f":"+O135","v":15},{"$f":"0.9-1.3*AE135","v":{"v":0.7050000000000001,"d":"0.705"}}]
[null,"Maissilage, BW gut",348,{"v":7,"d":"7.0"},{"v":11.47,"d":"11.5"},75,{"v":0.25,"d":"25%"},{"$f":"ROUND((11.93-(6.82*G136))*E136+1.03*G136*F136,0)","v":137},{"$f":"IF((F136-H136)/6.25<0,ROUND((F136-H136)/6.25,0),\"+\"&ROUND(((F136-H136)/6.25),0))","v":-10},{"$f":"L136*0.006-0.57","v":{"v":1.5,"d":"1.50"}},198,345,509,353,10,35,164,{"v":0.8,"d":"80%"},36,{"v":2,"d":"2.0"},2.4,0.1,1.2,{"v":11,"d":"11.0"},"...",130,null,"",{"$f":"+Q136","v":164},{"$f":"IF(N136=0,0.0001,N136)","v":353},{"v":0.15,"d":"15%"},{"$f":"+AD136*AE136","v":52.949999999999996},{"$f":"+O136","v":10},{"$f":"0.9-1.3*AE136","v":{"v":0.7050000000000001,"d":"0.705"}}]
[null,"Maissilage, BW mittel",341,{"v":6.73,"d":"6.7"},{"v":11.12,"d":"11.1"},75,{"v":0.25,"d":"25%"},135,-10,{"$f":"L137*0.006-0.57","v":{"v":1.6620000000000004,"d":"1.66"}},212,372,485,327,10,32,179,{"v":0.8,"d":"80%"},36,2.1,2.2,0.1,1.2,{"v":10,"d":"10.0"},"...",130,null,"",{"$f":"+Q137","v":179},{"$f":"IF(N137=0,0.0001,N137)","v":327},{"v":0.15,"d":"15%"},{"$f":"+AD137*AE137","v":49.05},{"$f":"+O137","v":10},{"$f":"0.9-1.3*AE137","v":{"v":0.7050000000000001,"d":"0.705"}}]
[null,"Maissilage, BW gering",325,{"v":6.47,"d":"6.5"},{"v":10.77,"d":"10.8"},76,{"v":0.25,"d":"25%"},130,-9,{"v":1.8600000000000003,"d":"1.86"},233,405,453,285,10,29,200,{"v":0.8,"d":"80%"},37,2.4,2.2,0.1,1.2,{"v":11,"d":"11.0"},"...",130,null,"",{"$f":"+Q138","v":200},{"$f":"IF(N138=0,0.0001,N138)","v":285},{"v":0.15,"d":"15%"},{"$f":"+AD138*AE138","v":42.75},{"$f":"+O138","v":10},{"$f":"0.9-1.3*AE138","v":{"v":0.7050000000000001,"d":"0.705"}}]
[null,"Pressschnitzel",320,7.2,{"$f":"D139/0.62","v":{"v":11.612903225806452,"d":"11.6"}},85,{"v":0.3,"d":"30%"},141,-9,1.05,217,483,349,0,31,6,233,{"v":0.25,"d":"25%"},77,9.9,1.3,0.3,2.1,{"v":4,"d":"4.0"},"...",-60,null,"",{"$f":"+Q139","v":233},{"$f":"IF(N139=0,0.0001,N139)","v":1E-4},{"v":0.1,"d":"10%"},{"$f":"+AD139*AE139","v":1e-05},{"$f":"+O139","v":31},{"$f":"0.9-1.3*AE139","v":{"v":0.77,"d":"0.770"}}]
[null,"Raps, jung, blattreich",150,{"v":6.69,"d":"6.7"},{"v":10.83,"d":"10.8"},195,{"v":0.15,"d":"15%"},148,"+8",{"$f":"L140*0.006+0.15","v":{"v":1.692,"d":"1.69"}},{"$f":"Q140*1.2","v":{"v":170.4,"d":"170"}},257,328,0,5,50,142,{"v":0.5,"d":"50%"},170,{"v":17,"d":"17.0"},4.5,1.3,2.6,{"v":32,"d":"32.0"},"...","...",null,""]
[null,"Roggen, BW gut",200,6.1,10.3,115,{"v":0.15,"d":"15%"},130,-2,{"$f":"L141*0.006+0.15","v":{"v":3.366,"d":"3.37"}},338,536,235,0,17,36,305,{"v":0.8,"d":"80%"},78,2.7,3.6,0.2,1.1,{"v":27,"d":"27.0"},"...",{"$f":"14*X141+3.5","v":{"v":381.5,"d":"382"}},null,""]
[null,"Roggen, BW mittel",315,5.6,9.5,116,{"v":0.15,"d":"15%"},122,{"$f":"IF((F142-H142)/6.25<0,ROUND((F142-H142)/6.25,0),\"+\"&ROUND(((F142-H142)/6.25),0))","v":-1},{"v":3.444,"d":"3.44"},342,549,{"$f":"IF(AND(S142<>\"\",F142<>\"\",L142<>\"\",P142<>\"\"),1000-F142-L142-P142-S142,\"Fehler\")","v":192},0,26,31,296,{"v":0.8,"d":"80%"},112,2.7,3.6,0.2,1.1,{"v":27,"d":"27.0"},null,{"$f":"14*X142+3.5","v":{"v":381.5,"d":"382"}}]
[null,"Roggen, BW gering",245,5.1,8.8,102,{"v":0.15,"d":"15%"},113,-2,{"v":3.612,"d":"3.61"},350,577,199,0,0,31,322,{"v":0.8,"d":"80%"},91,2.7,3.6,0.2,1.1,{"v":27,"d":"27.0"},null,{"v":381.5,"d":"382"}]
[null,"Rotklee-Gras-Gemenge, 1. S. BW gut",380,6.4,10.6,147,{"v":0.15,"d":"15%"},140,"+1",2.55,258,400,317,0,60,34,224,{"v":0.8,"d":"80%"},102,8.4,4.1,0.6,2.1,{"v":33,"d":"33.0"},null,{"v":465.5,"d":"466"}]
[null,"Rotklee-Gras-Gemenge, 1. S. BW mittel",390,5.6,9.6,146,{"v":0.15,"d":"15%"},128,"+3",2.73,313,430,282,0,57,31,249,{"v":0.8,"d":"80%"},111,13.4,3.1,0.5,2.5,25.1,null,{"v":354.90000000000003,"d":"355"}]
[null,"Rotklee-Gras-Gemenge, 1. S. BW gering",350,5.2,8.9,154,{"v":0.15,"d":"15%"},125,"+5",2.79,348,440,265,0,20,30,289,{"v":0.8,"d":"80%"},111,15.5,3.4,0.2,2.4,31.5,null,{"v":444.5,"d":"445"}]
[null,"Rotklee-Gras-Gemenge, Folgeschnitt, BW gut",{"$f":"(332*4+387*3)/7","v":{"v":355.57142857142856,"d":"356"}},{"$f":"(6.03*4+5.93*3)/7","v":{"v":5.987142857142857,"d":"6.0"}},{"$f":"(10.8*4+9.9*3)/7","v":{"v":10.414285714285715,"d":"10.4"}},{"$f":"(148*4+151*3)/7","v":{"v":149.28571428571428,"d":"149"}},{"v":0.15,"d":"15%"},{"$f":"(134*4+131*3)/7","v":{"v":132.71428571428572,"d":"133"}},"+3",{"v":2.7625714285714285,"d":"2.76"},{"$f":"(288*4+286*3)/7","v":{"v":287.14285714285717,"d":"287"}},{"$f":"(453*4+412*3)/7","v":{"v":435.42857142857144,"d":"435"}},{"v":272.42857142857144,"d":"272"},0,{"$f":"(60*4+47*3)/7","v":{"v":54.42857142857143,"d":"54"}},{"$f":"(36*4+33*3)/7","v":{"v":34.714285714285715,"d":"35"}},{"$f":"(253*4+239*3)/7","v":247},{"v":0.8,"d":"80%"},{"$f":"(103*4+115*3)/7","v":{"v":108.14285714285714,"d":"108"}},{"$f":"(6*4+7.8*3)/7","v":{"v":6.771428571428571,"d":"6.8"}},{"$f":"(3.6*4+3.6*3)/7","v":{"v":3.6000000000000005,"d":"3.6"}},{"$f":"(0.7*4+1.8*3)/7","v":{"v":1.1714285714285713,"d":"1.2"}},{"$f":"(2.3*4+3.3*3)/7","v":{"v":2.728571428571428,"d":"2.7"}},{"$f":"(25.6*4+30.7*3)/7","v":{"v":27.785714285714285,"d":"27.8"}},null,{"v":392.5,"d":"393"}]
[null,"Rotklee-Gras-Gemenge, Folgeschnitt, BW mittel",{"$f":"(394*19+324*4)/23","v":{"v":381.82608695652175,"d":"382"}},{"$f":"(5.64*19+5.65*4)/23","v":{"v":5.641739130434782,"d":"5.6"}},{"$f":"(9.57*19+9.52*4)/23","v":{"v":9.561304347826088,"d":"9.6"}},{"$f":"(146*19+165*4)/23","v":{"v":149.30434782608697,"d":"149"}},{"v":0.15,"d":"15%"},{"$f":"(128*19+129*4)/23","v":{"v":128.17391304347825,"d":"128"}},{"$f":"IF((F148-H148)/6.25<0,ROUND((F148-H148)/6.25,0),\"+\"&ROUND(((F148-H148)/6.25),0))","v":"+3"},{"$f":"L148*0.006+0.15","v":{"v":2.735217391304348,"d":"2.74"}},{"$f":"(313*19+291*4)/23","v":{"v":309.17391304347825,"d":"309"}},{"$f":"(430*19+435*4)/23","v":{"v":430.8695652173913,"d":"431"}},{"v":275.21739130434776,"d":"275"},0,{"$f":"(57*19+12*4)/23","v":{"v":49.17391304347826,"d":"49"}},{"$f":"(31*19+38*4)/23","v":{"v":32.21739130434783,"d":"32"}},{"$f":"(249*19+243*4)/23","v":{"v":247.95652173913044,"d":"248"}},{"v":0.8,"d":"80%"},{"$f":"(111*19+119*4)/23","v":{"v":112.3913043478261,"d":"112"}},{"$f":"(13.4*19+7.8*4)/23","v":{"v":12.42608695652174,"d":"12.4"}},{"$f":"(3.1*19+3.6*4)/23","v":{"v":3.1869565217391305,"d":"3.2"}},{"$f":"(0*19+1.8*4)/23","v":{"v":0.3130434782608696,"d":"0.3"}},{"$f":"(2.5*19+3.3*4)/23","v":{"v":2.639130434782609,"d":"2.6"}},{"$f":"(25.1*19+30.7*4)/23","v":{"v":26.073913043478264,"d":"26.1"}},null,{"v":368.5347826086957,"d":"369"}]
[null,"Rotklee-Gras-Gemenge, Folgeschnitt, BW gering",{"$f":"(353*7+391*2)/9","v":{"v":361.44444444444446,"d":"361"}},{"$f":"(5.19*7+5.45*2)/9","v":{"v":5.247777777777778,"d":"5.2"}},{"$f":"(8.87*7+9.25*2)/9","v":{"v":8.954444444444444,"d":"9.0"}},{"$f":"(154*7+208*2)/9","v":166},{"v":0.15,"d":"15%"},{"$f":"(125*7+141*2)/9","v":{"v":128.55555555555554,"d":"129"}},"+6",{"v":2.718,"d":"2.72"},{"$f":"(348*7+318*2)/9","v":{"v":341.3333333333333,"d":"341"}},{"$f":"(440*7+386*2)/9","v":428},{"v":261.4444444444444,"d":"261"},0,{"$f":"(20*7+23*2)/9","v":{"v":20.666666666666668,"d":"21"}},{"$f":"(30*7+34*2)/9","v":{"v":30.88888888888889,"d":"31"}},{"$f":"(289*7+245*2)/9","v":{"v":279.22222222222223,"d":"279"}},{"v":0.8,"d":"80%"},{"$f":"(111*7+123*2)/9","v":{"v":113.66666666666667,"d":"114"}},{"$f":"(15.5*7+7.8*2)/9","v":{"v":13.788888888888888,"d":"13.8"}},{"$f":"(3.4*7+3.6*2)/9","v":{"v":3.4444444444444446,"d":"3.4"}},{"$f":"(0.2*7+1.8*2)/9","v":{"v":0.5555555555555556,"d":"0.6"}},{"$f":"(2.4*7+3.3*2)/9","v":{"v":2.5999999999999996,"d":"2.6"}},{"$f":"(31.5*7+30.7*2)/9","v":{"v":31.32222222222222,"d":"31.3"}},null,{"v":442.01111111111106,"d":"442"}]
[null,"Silphie, Ende Blüte",270,3.6,6.6,72,{"v":0.15,"d":"15%"},{"$f":"(11.93-(6.82*(G150)))*E150+1.03*G150*F150","v":{"v":83.11019999999999,"d":"83"}},{"$f":"(F150-H150)/6.25","v":{"v":-1.7776319999999988,"d":"-2"}},{"v":2.898,"d":"2.90"},399,458,320,null,0,33,337,{"v":0.8,"d":"80%"},117,{"v":30,"d":"30.0"},2.2,{"v":0,"d":"0.0"},4.4,{"v":19,"d":"19.0"}]
[null,"Trester, Apfel",250,6.4,10.5,69,{"v":0.6,"d":"60%"},125,-9,{"$f":"ROUND(0.321+0.00098*AC151+0.00025*AF151-(0.00112*(AG151+AH151*(AD151-AF151))),2)","v":{"v":0.4,"d":"0.40"}},375,470,411,0,150,20,248,{"v":0,"d":"0%"},30,1.8,1.5,0.9,0.7,{"$f":"6.1/0.92","v":{"v":6.630434782608695,"d":"6.6"}},"...","...",null,"",{"$f":"+Q151","v":248},{"$f":"IF(N151=0,0.0001,N151)","v":1E-4},{"v":0.1,"d":"10%"},{"$f":"+AD151*AE151","v":1e-05},{"$f":"+O151","v":150},{"$f":"0.9-1.3*AE151","v":{"v":0.77,"d":"0.770"}}]
[null,"Weidelgras, Deutsches, 1 S., BW gut",386,6.9,{"v":11.31,"d":"11.3"},165,{"v":0.15,"d":"15%"},148,"+3",{"v":2.556,"d":"2.56"},234,401,299,0,108,35,217,{"v":0.8,"d":"80%"},100,5.6,4.4,{"v":1,"d":"1.0"},1.6,32.2,null,{"$f":"14.01*X152+3.5","v":{"v":454.622,"d":"455"}}]
[null,"Weidelgras, Deutsches, 1 S., BW mittel",322,{"v":6.41,"d":"6.4"},{"v":10.62,"d":"10.6"},151,{"v":0.15,"d":"15%"},139,"+2",{"v":2.538,"d":"2.54"},258,398,310,0,59,35,229,{"v":0.8,"d":"80%"},106,6.5,3.6,0.4,1.6,29.7,null,{"$f":"14.01*X153+3.5","v":{"v":419.597,"d":"420"}}]
[null,"Weidelgras, Deutsches, 1 S., BW gering",313,{"v":5.87,"d":"5.9"},{"v":9.85,"d":"9.9"},130,{"v":0.15,"d":"15%"},127,"+0",{"v":2.868,"d":"2.87"},292,453,269,0,49,34,259,{"v":0.8,"d":"80%"},114,6.2,{"v":4,"d":"4.0"},0.2,1.5,32.4,null,{"v":457.424,"d":"457"}]
[null,"Weidelgras, Deutsches, Folgeaufwuchs, BW gut",{"$f":"(363+404)/2","v":{"v":383.5,"d":"384"}},{"$f":"(6.51+5.94)/2","v":{"v":6.225,"d":"6.2"}},{"$f":"(10.73+9.99)/2","v":{"v":10.36,"d":"10.4"}},{"$f":"(165+171)/2","v":168},{"v":0.15,"d":"15%"},{"$f":"(142+135)/2","v":{"v":138.5,"d":"139"}},"+5",{"v":2.787,"d":"2.79"},{"$f":"(297+284)/2","v":{"v":290.5,"d":"291"}},{"$f":"(450+429)/2","v":{"v":439.5,"d":"440"}},{"v":241.5,"d":"242"},0,{"$f":"(55+41)/2","v":48},{"$f":"(42+40)/2","v":41},{"$f":"(328+226)/2","v":277},{"v":0.8,"d":"80%"},{"$f":"(123+97)/2","v":110},{"$f":"(5.8+11.8)/2","v":8.8},{"$f":"(6.3+3.3)/2","v":4.8},{"$f":"(0.8+0.3)/2","v":{"v":0.55,"d":"0.6"}},{"$f":"(1.6+2.9)/2","v":{"v":2.25,"d":"2.3"}},{"$f":"(38.5+21.4)/2","v":{"v":29.95,"d":"30.0"}},null,{"v":423.0995,"d":"423"}]
[null,"Weidelgras, Deutsches, Folgeaufwuchs, BW mittel",302,{"v":5.78,"d":"5.8"},{"v":9.73,"d":"9.7"},143,{"v":0.15,"d":"15%"},125,"+3",2.88,299,455,261,0,51,32,249,{"v":0.8,"d":"80%"},109,11.8,3.5,0.1,2.3,34.1,null,{"v":481.241,"d":"481"}]
[null,"Weidelgras, Deutsches, Folgeaufwuchs, BW gering",{"$f":"(371*3+457)/4","v":{"v":392.5,"d":"393"}},{"$f":"(5.07*3+5.5)/4","v":{"v":5.1775,"d":"5.2"}},{"$f":"(8.8*3+9.4)/4","v":{"v":8.950000000000001,"d":"9.0"}},{"$f":"(113*3+126)/4","v":{"v":116.25,"d":"116"}},{"v":0.15,"d":"15%"},{"$f":"(114*3+122)/4","v":116},"+0",{"v":3.168,"d":"3.17"},{"$f":"(379*3+322)/4","v":{"v":364.75,"d":"365"}},503,{"v":267.25,"d":"267"},0,{"$f":"(49*3+60)/4","v":{"v":51.75,"d":"52"}},{"$f":"(23*3+32)/4","v":{"v":25.25,"d":"25"}},{"$f":"(335*3+242)/4","v":{"v":311.75,"d":"312"}},{"v":0.8,"d":"80%"},{"$f":"(82*3+107)/4","v":{"v":88.25,"d":"88"}},{"$f":"(4*3+12)/4","v":{"v":6,"d":"6.0"}},{"$f":"(2.9*3+2.4)/4","v":{"v":2.775,"d":"2.8"}},0.1,1.1,19.4,null,{"v":275.294,"d":"275"}]
[null,"Weidelgras, Welsches, BW gut",388,{"v":6.97,"d":"7.0"},{"v":11.38,"d":"11.4"},171,{"v":0.15,"d":"15%"},149,"+4",{"$f":"ROUND(L158*0.006+0.15,1)","v":{"v":2.2,"d":"2.20"}},219,349,{"$f":"IF(AND(S158<>\"\",F158<>\"\",L158<>\"\",P158<>\"\"),1000-F158-L158-P158-S158,\"Fehler\")","v":335},0,123,36,189,{"v":0.8,"d":"80%"},109,5.1,2.7,0.1,{"v":1,"d":"1.0"},28.5,null,{"v":402.78499999999997,"d":"403"}]
[null,"Weidelgras, Welsches, BW mittel",296,{"v":6.32,"d":"6.3"},{"v":10.58,"d":"10.6"},133,{"v":0.15,"d":"15%"},135,{"$f":"IF((F159-H159)/6.25<0,ROUND((F159-H159)/6.25,0),\"+\"&ROUND(((F159-H159)/6.25),0))","v":0},{"$f":"ROUND(L159*0.006+0.15,1)","v":{"v":2.8,"d":"2.80"}},272,436,{"$f":"IF(AND(S159<>\"\",F159<>\"\",L159<>\"\",P159<>\"\"),1000-F159-L159-P159-S159,\"Fehler\")","v":303},0,54,32,246,{"v":0.8,"d":"80%"},96,5.1,3.8,0.2,1.4,{"v":33,"d":"33.0"},null,{"v":465.83,"d":"466"}]
[null,"Weidelgras, Welsches, BW gering",394,{"v":5.35,"d":"5.4"},{"v":9.05,"d":"9.1"},70,{"v":0.15,"d":"15%"},110,-6,{"v":3.8,"d":"3.80"},287,604,165,0,118,23,305,{"v":0.8,"d":"80%"},138,{"v":5,"d":"5.0"},{"v":2,"d":"2.0"},0.1,{"v":1,"d":"1.0"},28.5,null,{"v":402.78499999999997,"d":"403"}]
[null,"Zuckerrübenblatt, sauber",180,{"v":5.98,"d":"6.0"},{"v":9.83,"d":"9.8"},150,{"v":0.15,"d":"15%"},130,"+3",{"v":2.0100000000000002,"d":"2.01"},125,310,340,0,16,30,145,{"v":0.5,"d":"50%"},170,{"$f":"2.1/0.16","v":{"v":13.125,"d":"13.1"}},{"$f":"0.4/0.16","v":2.5},{"$f":"0.9/0.16","v":{"v":5.625,"d":"5.6"}},{"$f":"0.5/0.16","v":{"v":3.125,"d":"3.1"}},{"$f":"4.2/0.16","v":{"v":26.25,"d":"26.3"}},"...","...",null,""]
[{"$nulls":27},"x"]
["Heu/Stroh",null,1E-4,1E-4,1E-4,1E-4,1E-4,1E-4,1E-4,1E-4,1E-4,1E-4,1E-4,1E-4,1E-4,1E-4,1E-4,1E-4,1E-4,1E-4,1E-4,1E-4,1E-4,1E-4,1E-4]
[null,"Gerste, Stroh",860,3.8,6.9,32,{"v":0.45,"d":"45%"},75,{"$f":"IF((F164-H164)/6.25<0,ROUND((F164-H164)/6.25,0),\"+\"&ROUND(((F164-H164)/6.25),0))","v":-7},{"v":4.3,"d":"4.30"},522,790,110,0,7,14,471,{"v":1.5,"d":"150%"},54,3.4,1.1,0.3,0.8,14.1,"...",110,null,{"$f":"IF(COUNTA(B164:Y164)<21,\"x\",\"\")","v":""}]
[null,"Grassamenstroh, D. Weidelgras",860,4.2,7.4,54,{"v":0.4,"d":"40%"},91,{"$f":"IF((F165-H165)/6.25<0,ROUND((F165-H165)/6.25,0),\"+\"&ROUND(((F165-H165)/6.25),0))","v":-6},{"v":4.3,"d":"4.30"},400,709,{"$f":"IF(AND(S165<>\"\",F165<>\"\",L165<>\"\",P165<>\"\"),1000-F165-L165-P165-S165,\"Fehler\")","v":151},0,10,16,380,{"v":1.25,"d":"125%"},70,4.7,1.6,0.7,1.8,18.9,"...","..."]
[null,"Hafer, Stroh",860,{"v":3.66,"d":"3.7"},{"v":6.65,"d":"6.7"},36,{"v":0.4,"d":"40%"},{"$f":"ROUND((11.93-(6.82*G166))*E166+1.03*G166*F166,0)","v":76},-6,{"v":4.3,"d":"4.30"},{"$f":"1.1*Q166","v":{"v":484.00000000000006,"d":"484"}},{"$f":"1.8*Q166","v":792},91,0,14,15,440,{"v":1.5,"d":"150%"},66,{"v":4,"d":"4.0"},1.4,{"v":2,"d":"2.0"},{"v":1,"d":"1.0"},{"v":21,"d":"21.0"},"...",115,null,{"$f":"IF(COUNTA(B166:Y166)<21,\"x\",\"\")","v":""}]
[null,"Heu, 1. S., Bodentrocknung, BW extensiv, gut ",880,{"v":5.32,"d":"5.3"},{"v":9.16,"d":"9.2"},91,{"v":0.2,"d":"20%"},{"$f":"ROUND((11.93-(6.82*G167))*E167+1.03*G167*F167,0)","v":116},-4,{"$f":"ROUND(L167*0.006+0.15,1)","v":{"v":3.6,"d":"3.60"}},350,581,241,0,124,19,299,{"v":1,"d":"100%"},68,4.7,2.3,0.2,1.9,19.6,"...",{"$f":"14.01*X167+3.5","v":{"v":278.096,"d":"278"}},null,""]
[null,"Heu, 1. S., Bodentrocknung, BW extensiv, mittel",880,{"v":4.95,"d":"5.0"},{"v":8.61,"d":"8.6"},84,{"v":0.2,"d":"20%"},108,-4,{"v":3.7,"d":"3.70"},372,596,236,0,112,17,318,{"v":1,"d":"100%"},67,4.9,2.4,0.1,2.1,14.6,"...",{"$f":"14.01*X168+3.5","v":{"v":208.046,"d":"208"}},null,""]
[null,"Heu, 1. S., Bodentrocknung, BW extensiv, gering ",880,{"v":4.56,"d":"4.6"},{"v":8,"d":"8.0"},74,{"v":0.2,"d":"20%"},100,-4,{"v":3.8,"d":"3.80"},394,615,226,0,100,14,337,{"v":1,"d":"100%"},71,4.4,2.1,0.2,1.4,16.9,"...",{"v":240.26899999999998,"d":"240"},null,""]
[null,"Heu, 2. S., Bodentrocknung, BW extensiv, gut ",880,{"v":5.76,"d":"5.8"},{"v":9.74,"d":"9.7"},125,{"v":0.2,"d":"20%"},{"$f":"ROUND((11.93-(6.82*G170))*E170+1.03*G170*F170,0)","v":129},{"$f":"IF((F170-H170)/6.25<0,ROUND((F170-H170)/6.25,0),\"+\"&ROUND(((F170-H170)/6.25),0))","v":-1},{"$f":"ROUND(L170*0.006+0.15,1)","v":{"v":3.3,"d":"3.30"}},316,528,241,0,110,24,261,{"v":1,"d":"100%"},82,6.3,3.2,0.3,2.5,21.9,null,{"v":310.31899999999996,"d":"310"}]
[null,"Heu, 2. S., Bodentrocknung, BW extensiv, mittel",880,{"v":5.38,"d":"5.4"},9.2,119,{"v":0.2,"d":"20%"},122,0,{"v":3.4,"d":"3.40"},325,537,229,0,106,24,267,{"v":1,"d":"100%"},91,7.9,2.9,0.4,2.4,19.8,null,{"v":280.898,"d":"281"}]
[null,"Heu, 2. S., Bodentrocknung, BW extensiv, gering ",880,{"v":5,"d":"5.0"},{"v":8.63,"d":"8.6"},110,{"v":0.2,"d":"20%"},114,-1,{"v":3.6,"d":"3.60"},358,571,216,0,100,20,293,{"v":1,"d":"100%"},83,7.9,2.9,0.4,2.4,19.8,null,{"v":280.898,"d":"281"}]
[null,"Heu, 3. S., Bodentrocknung, BW extensiv, gut ",880,{"v":5.89,"d":"5.9"},{"v":9.92,"d":"9.9"},140,{"v":0.2,"d":"20%"},{"$f":"ROUND((11.93-(6.82*G173))*E173+1.03*G173*F173,0)","v":134},{"$f":"IF((F173-H173)/6.25<0,ROUND((F173-H173)/6.25,0),\"+\"&ROUND(((F173-H173)/6.25),0))","v":"+1"},{"$f":"ROUND(L173*0.006+0.15,1)","v":{"v":3.1,"d":"3.10"}},296,487,{"$f":"IF(AND(S173<>\"\",F173<>\"\",L173<>\"\",P173<>\"\"),1000-F173-L173-P173-S173,\"Fehler\")","v":255},0,99,27,243,{"v":1,"d":"100%"},91,7.5,3.9,0.1,2.9,24.7,null,{"v":349.54699999999997,"d":"350"}]
[null,"Heu, 3. S., Bodentrocknung, BW extensiv, mittel",880,{"v":5.45,"d":"5.5"},{"v":9.29,"d":"9.3"},134,{"v":0.2,"d":"20%"},126,"+1",{"v":3.5,"d":"3.50"},329,563,186,0,91,26,262,{"v":1,"d":"100%"},91,5.6,3.3,0.2,{"v":2,"d":"2.0"},26.7,null,{"v":377.567,"d":"378"}]
[null,"Heu, 3. S., Bodentrocknung, BW intensiv, gering ",880,{"v":4.88,"d":"4.9"},{"v":8.49,"d":"8.5"},107,{"v":0.2,"d":"20%"},112,-1,{"v":3.9,"d":"3.90"},387,622,155,0,84,18,332,{"v":1,"d":"100%"},98,5.6,3.3,0.2,{"v":2,"d":"2.0"},26.7,null,{"v":377.567,"d":"378"}]
[null,"Heu, 1. S., Bodentrocknung, BW intensiv, gut ",880,{"v":5.93,"d":"5.9"},{"v":10.03,"d":"10.0"},122,{"v":0.2,"d":"20%"},{"$f":"ROUND((11.93-(6.82*G176))*E176+1.03*G176*F176,0)","v":131},{"$f":"IF((F176-H176)/6.25<0,ROUND((F176-H176)/6.25,0),\"+\"&ROUND(((F176-H176)/6.25),0))","v":-1},{"$f":"ROUND(L176*0.006+0.15,1)","v":{"v":3.3,"d":"3.30"}},301,524,248,0,141,24,257,{"v":1,"d":"100%"},82,3.9,2.7,0.3,1.8,{"v":17,"d":"17.0"},null,{"v":241.67,"d":"242"}]
[null,"Heu, 1. S., Bodentrocknung, BW intensiv, mittel",880,5.3,{"v":9.11,"d":"9.1"},94,{"v":0.2,"d":"20%"},116,-4,{"v":3.7,"d":"3.70"},346,588,228,0,126,19,301,{"v":1,"d":"100%"},71,{"v":4,"d":"4.0"},23.6,0.2,1.4,21.4,null,{"v":303.31399999999996,"d":"303"}]
[null,"Heu, 1. S., Bodentrocknung, BW intensiv, gering ",880,4.8,{"v":8.38,"d":"8.4"},77,{"v":0.2,"d":"20%"},104,-4,{"v":3.8,"d":"3.80"},380,608,232,0,103,16,330,{"v":1,"d":"100%"},67,4.3,1.9,0.2,1.3,17.9,null,{"v":254.27899999999997,"d":"254"}]
[null,"Heu, 2. S., Bodentrocknung, BW intensiv, gut ",880,{"v":6.08,"d":"6.1"},{"v":10.21,"d":"10.2"},123,{"v":0.2,"d":"20%"},{"$f":"ROUND((11.93-(6.82*G179))*E179+1.03*G179*F179,0)","v":133},{"$f":"IF((F179-H179)/6.25<0,ROUND((F179-H179)/6.25,0),\"+\"&ROUND(((F179-H179)/6.25),0))","v":-2},{"$f":"ROUND(L179*0.006+0.15,1)","v":{"v":3.4,"d":"3.40"}},304,545,{"$f":"IF(AND(S179<>\"\",F179<>\"\",L179<>\"\",P179<>\"\"),1000-F179-L179-P179-S179,\"Fehler\")","v":228},0,138,25,250,{"v":1,"d":"100%"},79,5.2,3.2,0.3,{"v":2,"d":"2.0"},21.4,null,{"v":303.31399999999996,"d":"303"}]
[null,"Heu, 2. S., Bodentrocknung, BW intensiv, mittel",880,{"v":5.66,"d":"5.7"},9.6,129,{"v":0.2,"d":"20%"},128,"+0",{"v":3.5,"d":"3.50"},320,556,209,0,119,23,276,{"v":1,"d":"100%"},83,5.8,2.7,0.3,{"v":2,"d":"2.0"},21.4,null,{"v":303.31399999999996,"d":"303"}]
[null,"Heu, 2. S., Bodentrocknung, BW intensiv, gering ",880,{"v":5.26,"d":"5.3"},{"v":8.99,"d":"9.0"},124,{"v":0.2,"d":"20%"},121,"+0",{"v":3.4,"d":"3.40"},340,544,209,0,91,23,276,{"v":1,"d":"100%"},100,{"v":4,"d":"4.0"},3.3,0.3,{"v":2,"d":"2.0"},21.4,null,{"v":303.31399999999996,"d":"303"}]
[null,"Heu, 1. S., Unterdachtrocknung, BW intensiv, gut ",880,{"v":6.16,"d":"6.2"},10.3,146,{"v":0.2,"d":"20%"},{"$f":"ROUND((11.93-(6.82*G182))*E182+1.03*G182*F182,0)","v":139},{"$f":"IF((F182-H182)/6.25<0,ROUND((F182-H182)/6.25,0),\"+\"&ROUND(((F182-H182)/6.25),0))","v":"+1"},{"$f":"ROUND(L182*0.006+0.15,1)","v":{"v":3.1,"d":"3.10"}},282,486,256,0,128,24,243,{"v":1,"d":"100%"},88,{"v":4,"d":"4.0"},2.5,0.2,1.3,22.9,null,{"v":324.32899999999995,"d":"324"}]
[null,"Heu, 1. S., Unterdachtrocknung, BW intensiv, mittel ",880,{"v":5.62,"d":"5.6"},{"v":9.63,"d":"9.6"},100,{"v":0.2,"d":"20%"},122,-4,{"v":3.6,"d":"3.60"},335,577,236,0,143,20,284,{"v":1,"d":"100%"},67,{"v":4,"d":"4.0"},2.5,0.2,1.3,22.9,null,{"v":324.32899999999995,"d":"324"}]
[null,"Heu, 1. S., Unterdachtrocknung, BW intensiv, gering",880,5.4,{"v":9.22,"d":"9.2"},105,{"v":0.2,"d":"20%"},119,-2,{"v":3.5,"d":"3.50"},335,564,240,0,132,19,284,{"v":1,"d":"100%"},72,{"v":4,"d":"4.0"},2.5,0.2,1.3,22.9,null,{"v":324.32899999999995,"d":"324"}]
[null,"Heu, 2. S., Unterdachtrocknung, BW intensiv, gut ",880,{"v":6.42,"d":"6.4"},{"v":10.59,"d":"10.6"},197,{"v":0.2,"d":"20%"},{"$f":"ROUND((11.93-(6.82*G185))*E185+1.03*G185*F185,0)","v":152},{"$f":"IF((F185-H185)/6.25<0,ROUND((F185-H185)/6.25,0),\"+\"&ROUND(((F185-H185)/6.25),0))","v":"+7"},{"$f":"ROUND(L185*0.006+0.15,1)","v":{"v":2.8,"d":"2.80"}},261,446,216,0,89,29,202,{"v":1,"d":"100%"},112,8.4,3.9,{"v":1,"d":"1.0"},3.5,20.7,null,{"v":293.507,"d":"294"}]
[null,"Heu, 2. S., Unterdachtrocknung, BW intensiv, mittel ",880,{"v":6.09,"d":"6.1"},{"v":10.22,"d":"10.2"},134,{"v":0.2,"d":"20%"},136,0,{"v":3,"d":"3.00"},285,478,274,0,159,24,231,{"v":1,"d":"100%"},90,{"v":10,"d":"10.0"},3.5,{"v":1,"d":"1.0"},2.1,{"v":26,"d":"26.0"},null,{"v":367.76,"d":"368"}]
[null,"Heu, 2. S., Unterdachtrocknung, BW intensiv, gering",880,{"v":5.85,"d":"5.9"},9.9,134,{"v":0.2,"d":"20%"},132,"+0",{"v":3.3,"d":"3.30"},307,522,240,0,124,26,242,{"v":1,"d":"100%"},78,7.4,3.3,{"v":1,"d":"1.0"},2.8,{"v":21,"d":"21.0"},null,{"v":297.71,"d":"298"}]
[null,"Heu, 3. S., Unterdachtrocknung, BW intensiv, gut ",880,{"v":6.27,"d":"6.3"},{"v":10.45,"d":"10.5"},156,{"v":0.2,"d":"20%"},{"$f":"ROUND((11.93-(6.82*G188))*E188+1.03*G188*F188,0)","v":143},{"$f":"IF((F188-H188)/6.25<0,ROUND((F188-H188)/6.25,0),\"+\"&ROUND(((F188-H188)/6.25),0))","v":"+2"},{"$f":"ROUND(L188*0.006+0.15,1)","v":{"v":3.1,"d":"3.10"}},276,497,{"$f":"IF(AND(S188<>\"\",F188<>\"\",L188<>\"\",P188<>\"\"),1000-F188-L188-P188-S188,\"Fehler\")","v":214},0,115,30,226,{"v":1,"d":"100%"},103,6.6,3.9,0.2,2.6,35.8,null,{"v":505.05799999999994,"d":"505"}]
[null,"Heu, 3. S., Unterdachtrocknung, BW intensiv, mittel ",880,{"v":5.72,"d":"5.7"},{"v":9.62,"d":"9.6"},146,{"v":0.2,"d":"20%"},132,"+2",{"v":3.1,"d":"3.10"},296,484,219,0,110,28,257,{"v":1,"d":"100%"},123,5.7,4.5,0.2,1.9,21.1,null,{"v":299.111,"d":"299"}]
[null,"Heu, 3. S., Unterdachtrocknung, BW intensiv, gering",880,5.4,{"v":9.25,"d":"9.3"},121,{"v":0.2,"d":"20%"},123,0,{"v":3.4,"d":"3.40"},330,536,236,0,123,22,276,{"v":1,"d":"100%"},85,6.6,4.1,0.2,2.1,21.4,null,{"v":303.31399999999996,"d":"303"}]
[null,"Heu, 3. S., Heißlufttrocknung, BW intensiv",920,{"v":7.25,"d":"7.3"},{"v":11.79,"d":"11.8"},188,{"v":0.4,"d":"40%"},{"$f":"ROUND((11.93-(6.82*G191))*E191+1.03*G191*F191,0)","v":186},{"$f":"IF((F191-H191)/6.25<0,ROUND((F191-H191)/6.25,0),\"+\"&ROUND(((F191-H191)/6.25),0))","v":"+0"},{"$f":"ROUND(L191*0.006+0.15,1)","v":{"v":2.5,"d":"2.50"}},189,393,{"$f":"IF(AND(S191<>\"\",F191<>\"\",L191<>\"\",P191<>\"\"),1000-F191-L191-P191-S191,\"Fehler\")","v":288},0,184,36,146,{"v":1,"d":"100%"},95,{"v":10,"d":"10.0"},{"v":4,"d":"4.0"},0.8,3.6,{"v":25,"d":"25.0"},null,{"v":353.75,"d":"354"}]
[null,"Heu, 3. S., Heißlufttrocknung, BW mittel",920,{"v":6.55,"d":"6.6"},{"v":10.83,"d":"10.8"},183,{"v":0.4,"d":"40%"},175,"+1",{"v":2.9,"d":"2.90"},250,455,222,0,117,38,209,{"v":1,"d":"100%"},102,{"v":10,"d":"10.0"},{"v":4,"d":"4.0"},0.8,3.6,{"v":25,"d":"25.0"},null,{"v":353.75,"d":"354"}]
[null,"Heu, 3. S., Heißlufttrocknung, BW gering",920,{"v":5.85,"d":"5.9"},{"v":9.84,"d":"9.8"},152,{"v":0.4,"d":"40%"},153,0,{"v":2.9,"d":"2.90"},285,459,243,0,102,28,235,{"v":1,"d":"100%"},118,{"v":10,"d":"10.0"},{"v":4,"d":"4.0"},0.8,3.6,{"v":25,"d":"25.0"},null,{"v":353.75,"d":"354"}]
[null,"Kleegras, 1. S., i. d. Knospe",860,5.9,{"v":10,"d":"10.0"},140,{"v":0.2,"d":"20%"},135,"+1",{"$f":"ROUND((+Q194*0.0125-0.2)*1.05,1)","v":{"v":3.2,"d":"3.20"}},{"$f":"Q194*1.05","v":273},{"$f":"Q194*2.3","v":598},143,0,30,25,260,{"v":1,"d":"100%"},94,{"v":15,"d":"15.0"},2.5,0.5,3.2,{"v":20,"d":"20.0"},"...",415,null,""]
[null,"Kleegras, Mitte-Ende Blüte",860,5.1,8.7,125,{"v":0.2,"d":"20%"},118,"+1",{"v":4.1,"d":"4.10"},{"$f":"Q195*1.05","v":{"v":346.5,"d":"347"}},{"$f":"Q195*2.3","v":{"v":758.9999999999999,"d":"759"}},{"v":8.000000000000114,"d":"8"},0,25,25,330,{"v":1,"d":"100%"},83,{"v":15,"d":"15.0"},2.5,0.5,3.2,{"v":20,"d":"20.0"},"...",415,null,""]
[null,"Luzerne, 1. S.  Beginn Blüte",860,4.9,{"v":8.52,"d":"8.5"},185,{"v":0.25,"d":"25%"},{"$f":"ROUND((11.93-(6.82*G196))*E196+1.03*G196*F196,0)","v":135},{"$f":"IF((F196-H196)/6.25<0,ROUND((F196-H196)/6.25,0),\"+\"&ROUND(((F196-H196)/6.25),0))","v":"+8"},{"$f":"ROUND((+Q196*0.0125-0.2)*1.05,1)","v":{"v":3.8,"d":"3.80"}},{"$f":"1.35*Q196","v":{"v":411.75,"d":"412"}},{"$f":"1.6*Q196","v":488},{"$f":"IF(AND(S196<>\"\",F196<>\"\",L196<>\"\",P196<>\"\"),1000-F196-L196-P196-S196,\"Fehler\")","v":219},0,60,20,305,{"v":1,"d":"100%"},88,{"v":16,"d":"16.0"},3.5,0.8,3.1,{"v":30,"d":"30.0"},"...",{"$f":"14.01*X196+3.5","v":{"v":423.8,"d":"424"}},null,""]
[null,"Luzerne, Folgeaufwuchs, Beginn Blüte",860,{"v":4.63,"d":"4.6"},{"v":8.12,"d":"8.1"},180,{"v":0.25,"d":"25%"},{"$f":"ROUND((11.93-(6.82*G197))*E197+1.03*G197*F197,0)","v":129},{"$f":"IF((F197-H197)/6.25<0,ROUND((F197-H197)/6.25,0),\"+\"&ROUND(((F197-H197)/6.25),0))","v":"+8"},{"$f":"ROUND((+Q197*0.0125-0.2)*1.05,1)","v":{"v":3.7,"d":"3.70"}},{"$f":"1.35*Q197","v":405},{"$f":"1.6*Q197","v":480},{"$f":"IF(AND(S197<>\"\",F197<>\"\",L197<>\"\",P197<>\"\"),1000-F197-L197-P197-S197,\"Fehler\")","v":224},0,50,20,300,{"v":1,"d":"100%"},96,{"v":18,"d":"18.0"},3.1,0.8,3.9,{"v":27,"d":"27.0"},"...",{"$f":"14.01*X197+3.5","v":{"v":381.77,"d":"382"}},null,""]
[null,"Weizen, Stroh",860,{"v":4,"d":"4.0"},{"$f":"D198/0.63","v":{"v":6.349206349206349,"d":"6.3"}},48,{"v":0.45,"d":"45%"},80,-5,{"v":4.3,"d":"4.30"},480,753,121,0,8,16,442,{"v":1.5,"d":"150%"},62,2.9,1.5,0.2,0.8,12.3,"...",95,null,""]
[{"$nulls":27},"x"]
["Handelsfuttermittel",null,1E-4,1E-4,1E-4,1E-4,1E-4,1E-4,1E-4,1E-4,1E-4,1E-4,1E-4,1E-4,1E-4,1E-4,1E-4,1E-4,1E-4,1E-4,1E-4,1E-4,1E-4,1E-4,1E-4]
[null,"Ackerbohnen",880,8.5,{"$f":"D201/0.63","v":{"v":13.492063492063492,"d":"13.5"}},272,{"v":0.15,"d":"15%"},{"$f":"ROUND((11.93-(6.82*G201))*E201+1.03*G201*F201,0)","v":189},{"$f":"IF((F201-H201)/6.25<0,ROUND((F201-H201)/6.25,0),\"+\"&ROUND(((F201-H201)/6.25),0))","v":"+13"},{"$f":"ROUND(0.321+0.00098*AC201+0.00025*AF201-(0.00112*(AG201+AH201*(AD201-AF201))),2)","v":0.27},185,313,{"$f":"IF(AND(S201<>\"\",F201<>\"\",L201<>\"\",P201<>\"\"),1000-F201-L201-P201-S201,\"Fehler\")","v":360},410,40,15,170,{"v":0,"d":"0%"},40,1.8,{"v":9,"d":"9.0"},0.3,1.5,{"v":14,"d":"14.0"},"...",5,null,{"$f":"IF(COUNTA(B201:Y201)<21,\"x\",\"\")","v":""},{"$f":"+Q201","v":170},{"$f":"IF(N201=0,0.0001,N201)","v":410},{"v":0.25,"d":"25%"},{"$f":"+AD201*AE201","v":102.5},{"$f":"+O201","v":40},{"$f":"0.9-1.3*AE201","v":0.575}]
[null,"Baumwollextraktionsschrot, teilgesch.",900,6.5,{"v":11,"d":"11.0"},445,{"v":0.4,"d":"40%"},{"$f":"ROUND((11.93-(6.82*G202))*E202+1.03*G202*F202,0)","v":285},{"$f":"IF((F202-H202)/6.25<0,ROUND((F202-H202)/6.25,0),\"+\"&ROUND(((F202-H202)/6.25),0))","v":"+26"},0.41,205,310,161,0,55,15,150,{"v":0,"d":"0%"},69,2.3,{"v":12,"d":"12.0"},0.6,{"$f":"4.9/0.9","v":{"v":5.444444444444445,"d":"5.4"}},{"v":15,"d":"15.0"},"...","...",null,{"$f":"IF(COUNTA(B202:Y202)<21,\"x\",\"\")","v":""},150,1E-4,{"v":1,"d":"100%"},1E-4,55,{"v":-0.4,"d":"-0.400"}]
[null,"Bierhefe, getr.",930,7.3,{"$f":"D203/0.63","v":{"v":11.587301587301587,"d":"11.6"}},495,{"v":0.2,"d":"20%"},{"$f":"ROUND((11.93-(6.82*G203))*E203+1.03*G203*F203,0)","v":224},{"$f":"IF((F203-H203)/6.25<0,ROUND((F203-H203)/6.25,0),\"+\"&ROUND(((F203-H203)/6.25),0))","v":"+43"},0.31,4,8,386,0,15,30,3,{"v":0,"d":"0%"},81,1.5,{"v":16,"d":"16.0"},0.1,2.2,{"v":24,"d":"24.0"},"...","...",null,{"$f":"IF(COUNTA(B203:Y203)<21,\"x\",\"\")","v":""},3,1E-4,{"v":0.1,"d":"10%"},1e-05,15,{"v":0.77,"d":"0.770"}]
[null,"DDGS (Trockenschlempe)",940,{"$f":"7/0.94","v":{"v":7.446808510638299,"d":"7.4"}},{"$f":"D204/0.6","v":{"v":12.411347517730498,"d":"12.4"}},{"$f":"312/0.94","v":{"v":331.9148936170213,"d":"332"}},{"v":0.4,"d":"40%"},{"$f":"ROUND((11.93-(6.82*G204))*E204+1.03*G204*F204,0)","v":251},{"$f":"IF((F204-H204)/6.25<0,ROUND((F204-H204)/6.25,0),\"+\"&ROUND(((F204-H204)/6.25),0))","v":"+13"},{"$f":"ROUND(0.321+0.00098*AC204+0.00025*AF204-(0.00112*(AG204+AH204*(AD204-AF204))),2)","v":0.39},{"$f":"175/0.94","v":{"v":186.17021276595744,"d":"186"}},{"$f":"306/0.94","v":{"v":325.53191489361706,"d":"326"}},{"v":215.95744680851055,"d":"216"},0,0,{"$f":"62/0.94","v":{"v":65.95744680851064,"d":"66"}},{"$f":"70/0.94","v":{"v":74.46808510638299,"d":"74"}},{"v":0,"d":"0%"},{"$f":"57/0.94","v":{"v":60.63829787234043,"d":"61"}},{"$f":"0.8/0.94","v":{"v":0.8510638297872342,"d":"0.9"}},{"$f":"8.2/0.94","v":{"v":8.72340425531915,"d":"8.7"}},{"$f":"4.71/0.94","v":{"v":5.01063829787234,"d":"5.0"}},{"$f":"2.8/0.94","v":{"v":2.978723404255319,"d":"3.0"}},{"$f":"14.1/0.94","v":{"v":15,"d":"15.0"}},"...",-310,null,null,74.46808510638299,1E-4,{"v":0.1,"d":"10%"},{"$f":"+AD204*AE204","v":1e-05},0,{"$f":"0.9-1.3*AE204","v":{"v":0.77,"d":"0.770"}}]
[null,"Erbsen",880,{"v":8.52,"d":"8.5"},{"v":13.44,"d":"13.4"},235,{"v":0.15,"d":"15%"},{"$f":"ROUND((11.93-(6.82*G205))*E205+1.03*G205*F205,0)","v":183},{"$f":"IF((F205-H205)/6.25<0,ROUND((F205-H205)/6.25,0),\"+\"&ROUND(((F205-H205)/6.25),0))","v":"+8"},-0.04,{"$f":"1.5*Q205","v":{"v":97.5,"d":"98"}},{"$f":"3.1*Q205","v":{"v":201.5,"d":"202"}},{"v":514.5,"d":"515"},480,60,15,65,{"v":0,"d":"0%"},34,0.9,4.8,0.3,1.3,{"v":11,"d":"11.0"},"...",140,null,{"$f":"IF(COUNTA(B205:Y205)<21,\"x\",\"\")","v":""},65,480,{"v":0.1,"d":"10%"},48,60,{"v":0.77,"d":"0.770"}]
[null,"Erdnußextraktionsschrot, enthülst",890,8.6,13.8,570,{"v":0.3,"d":"30%"},{"$f":"ROUND((11.93-(6.82*G206))*E206+1.03*G206*F206,0)","v":313},{"$f":"IF((F206-H206)/6.25<0,ROUND((F206-H206)/6.25,0),\"+\"&ROUND(((F206-H206)/6.25),0))","v":"+41"},0.26,{"$f":"Q206*1.25","v":75},{"$f":"2.1*Q206","v":126},224,100,115,15,60,{"v":0,"d":"0%"},65,{"$f":"1.4/0.92","v":{"v":1.5217391304347825,"d":"1.5"}},{"$f":"5.9/0.92","v":{"v":6.41304347826087,"d":"6.4"}},{"$f":"0.4/0.92","v":{"v":0.43478260869565216,"d":"0.4"}},{"$f":"3.3/0.92","v":{"v":3.58695652173913,"d":"3.6"}},{"$f":"11.4/0.92","v":{"v":12.391304347826086,"d":"12.4"}},"...","...",null,"",60,100,{"v":1.25,"d":"125%"},125,115,-0.725]
[null,"Gerste (Winter), Körner",880,7.9,{"$f":"D207/0.63","v":{"v":12.53968253968254,"d":"12.5"}},100,{"v":0.25,"d":"25%"},154,-9,-0.08,85,225,618,605,20,25,80,{"v":0,"d":"0%"},32,1.2,4.9,0.1,1.1,8.4,"...",5,null,"",80,605,{"v":0.1,"d":"10%"},60.5,20,{"v":0.77,"d":"0.770"}]
[null,"Grünmehl, Gras, 1. Aufwuchs, Schossen",890,{"v":6.58,"d":"6.6"},{"v":10.84,"d":"10.8"},185,{"v":0.4,"d":"40%"},176,"+1",0.41,{"$f":"1.2*Q208","v":240},{"$f":"1.8*Q208","v":360},309,0,100,35,200,{"v":0,"d":"0%"},111,{"v":10,"d":"10.0"},{"v":4,"d":"4.0"},0.8,3.6,{"v":25,"d":"25.0"},"...","...",null,"",200,1E-4,{"v":1,"d":"100%"},1E-4,100,{"v":-0.4,"d":"-0.400"}]
[null,"Grünmehl, Gras, Folgeaufwuchs, Herbst",890,5.9,9.8,200,{"v":0.4,"d":"40%"},173,"+4",0.41,{"$f":"1.2*Q209","v":246},{"$f":"1.8*Q209","v":369},298,0,100,35,205,{"v":0,"d":"0%"},98,{"v":10,"d":"10.0"},{"v":4,"d":"4.0"},0.8,3.6,{"v":25,"d":"25.0"},"...","...",null,"",205,1E-4,{"v":1,"d":"100%"},{"$f":"+AD209*AE209","v":1E-4},100,{"$f":"0.9-1.3*AE209","v":{"v":-0.4,"d":"-0.400"}}]
[null,"Grünmehl, Luzerne, v.d. Knospe",890,{"v":5.88,"d":"5.9"},{"v":9.84,"d":"9.8"},210,{"v":0.4,"d":"40%"},177,"+5",0.45,{"$f":"1.1*Q210","v":{"v":203.50000000000003,"d":"204"}},{"$f":"1.5*Q210","v":{"v":277.5,"d":"278"}},{"v":364.5,"d":"365"},0,50,30,185,{"v":0,"d":"0%"},118,{"v":18,"d":"18.0"},3.8,0.5,{"v":3,"d":"3.0"},{"v":27,"d":"27.0"},"...","...",null,"",185,1E-4,{"v":1,"d":"100%"},1E-4,50,{"v":-0.4,"d":"-0.400"}]
[null,"Hafer, Körner",880,{"v":6.97,"d":"7.0"},{"v":11.53,"d":"11.5"},123,{"v":0.15,"d":"15%"},145,-4,0.13,{"$f":"1.4*Q211","v":154},{"$f":"2.8*Q211","v":308},486,450,15,50,110,{"v":0,"d":"0%"},33,1.2,3.6,0.4,{"$f":"1.136*1.1","v":{"v":1.2496,"d":"1.2"}},{"$f":"4.4/0.88","v":{"v":5,"d":"5.0"}},"...",-40,null,"",110,450,{"v":0.15,"d":"15%"},67.5,15,{"v":0.7050000000000001,"d":"0.705"}]
[null,"Haferschälkleie",910,{"v":4,"d":"4.0"},{"$f":"D212/0.6","v":{"v":6.666666666666667,"d":"6.7"}},90,{"v":0.15,"d":"15%"},87,"+0",0.42,{"$f":"1.2*Q212","v":264},{"$f":"2.3*Q212","v":{"v":505.99999999999994,"d":"506"}},{"v":331.00000000000006,"d":"331"},170,10,30,220,{"v":0,"d":"0%"},43,1.1,{"v":3,"d":"3.0"},0.1,1.1,5.1,"...","...",null,"",220,170,{"v":0.15,"d":"15%"},25.5,10,{"v":0.7050000000000001,"d":"0.705"}]
[null,"Kokosextraktionsschrot",900,6.7,{"$f":"D213/0.6","v":{"v":11.166666666666668,"d":"11.2"}},235,{"v":0.5,"d":"50%"},{"$f":"ROUND((11.93-(6.82*G213))*E213+1.03*G213*F213,0)","v":216},{"$f":"IF((F213-H213)/6.25<0,ROUND((F213-H213)/6.25,0),\"+\"&ROUND(((F213-H213)/6.25),0))","v":"+3"},0.35,350,665,0,0,120,25,170,{"v":0,"d":"0%"},75,1.8,{"$f":"5.9/0.9","v":{"v":6.555555555555555,"d":"6.6"}},{"$f":"0.85/0.9","v":{"v":0.9444444444444444,"d":"0.9"}},3.9,{"v":18,"d":"18.0"},"...","...",null,"",170,1E-4,{"v":1,"d":"100%"},{"$f":"+AD213*AE213","v":1E-4},120,{"$f":"0.9-1.3*AE213","v":{"v":-0.4,"d":"-0.400"}}]
[null,"Leinextraktionsschrot",890,7.3,{"v":12,"d":"12.0"},385,{"v":0.3,"d":"30%"},238,"+24",0.35,185,310,199,0,65,40,105,{"v":0,"d":"0%"},66,{"v":4,"d":"4.0"},9.7,{"v":1,"d":"1.0"},5.6,{"v":12,"d":"12.0"},"...",80,null,"",105,1E-4,{"v":1,"d":"100%"},1E-4,65,{"v":-0.4,"d":"-0.400"}]
[null,"Lupine, süß,  Körner",880,8.9,{"v":14.73,"d":"14.7"},376,{"v":0.2,"d":"20%"},{"$f":"ROUND((11.93-(6.82*G215))*E215+1.03*G215*F215,0)","v":233},{"$f":"IF((F215-H215)/6.25<0,ROUND((F215-H215)/6.25,0),\"+\"&ROUND(((F215-H215)/6.25),0))","v":"+23"},{"$f":"ROUND(0.321+0.00098*AC215+0.00025*AF215-(0.00112*(AG215+AH215*(AD215-AF215))),2)","v":0.32},{"$f":"1.2*Q215","v":162},{"$f":"1.7*Q215","v":{"v":229.5,"d":"230"}},{"$f":"IF(AND(S215<>\"\",F215<>\"\",L215<>\"\",P215<>\"\"),1000-F215-L215-P215-S215,\"Fehler\")","v":{"v":269.5,"d":"270"}},73,74,90,135,{"v":0,"d":"0%"},35,2.9,5.1,0.6,{"v":2,"d":"2.0"},{"v":10,"d":"10.0"},"...","...",null,"",135,73,{"v":0.15,"d":"15%"},{"$f":"+AD215*AE215","v":10.95},74,{"$f":"0.9-1.3*AE215","v":{"v":0.7050000000000001,"d":"0.705"}}]
[null,"Mais, Körner",880,{"v":8.38,"d":"8.4"},{"v":13.28,"d":"13.3"},102,{"v":0.5,"d":"50%"},166,-10,0.22,{"$f":"1.1*Q216","v":{"v":27.500000000000004,"d":"28"}},{"$f":"4.4*Q216","v":{"v":110.00000000000001,"d":"110"}},726,695,20,45,25,{"v":0,"d":"0%"},17,0.4,3.5,0.2,1.3,{"v":4,"d":"4.0"},"...",-35,null,"",25,695,{"v":0.4,"d":"40%"},278,20,{"v":0.38,"d":"0.380"}]
[null,"Maiskeime",890,{"$f":"8.6/0.89","v":{"v":9.662921348314606,"d":"9.7"}},{"$f":"D217/0.6","v":{"v":16.10486891385768,"d":"16.1"}},{"$f":"126/0.89","v":{"v":141.57303370786516,"d":"142"}},{"v":0.4,"d":"40%"},{"$f":"ROUND((11.93-(6.82*G217))*E217+1.03*G217*F217,0)","v":207},{"$f":"IF((F217-H217)/6.25<0,ROUND((F217-H217)/6.25,0),\"+\"&ROUND(((F217-H217)/6.25),0))","v":-10},{"$f":"ROUND(0.321+0.00098*AC217+0.00025*AF217-(0.00112*(AG217+AH217*(AD217-AF217))),2)","v":0.21},{"$f":"93/0.89","v":{"v":104.49438202247191,"d":"104"}},{"$f":"253/0.89","v":{"v":284.2696629213483,"d":"284"}},{"v":306.7415730337079,"d":"307"},500,70,{"$f":"189/0.89","v":{"v":212.35955056179776,"d":"212"}},{"$f":"43/0.89","v":{"v":48.31460674157303,"d":"48"}},{"v":0,"d":"0%"},{"$f":"49/0.89","v":{"v":55.056179775280896,"d":"55"}},{"$f":"0.6/0.89","v":{"v":0.6741573033707865,"d":"0.7"}},{"$f":"12.3/0.89","v":{"v":13.820224719101125,"d":"13.8"}},{"$f":"0.03/0.89","v":{"v":0.033707865168539325,"d":"0.0"}},{"$f":"5/0.89","v":{"v":5.617977528089887,"d":"5.6"}},{"$f":"10.9/0.89","v":{"v":12.247191011235955,"d":"12.2"}},"...","...",null,null,48.31460674157303,500,{"v":0.4,"d":"40%"},{"$f":"+AD217*AE217","v":200},70,{"$f":"0.9-1.3*AE217","v":{"v":0.38,"d":"0.380"}}]
[null,"Maiskleber",900,8.5,{"$f":"D218*0.63","v":{"v":5.355,"d":"5.4"}},600,{"v":0.7,"d":"70%"},471,"+21",0.23,90,320,5,145,5,55,10,{"v":0,"d":"0%"},20,0.8,4.6,0.2,{"$f":"0.3/0.9","v":{"v":0.3333333333333333,"d":"0.3"}},{"v":1,"d":"1.0"},"...","...",null,{"$f":"IF(COUNTA(B218:Y218)<21,\"x\",\"\")","v":""},10,145,{"v":0.15,"d":"15%"},21.75,5,{"v":0.7050000000000001,"d":"0.705"}]
[null,"Maiskleberfutter",890,{"v":7.69,"d":"7.7"},{"v":12.43,"d":"12.4"},260,{"v":0.25,"d":"25%"},194,"+11",0.26,{"$f":"1.3*Q219","v":117},{"$f":"2.8*Q219","v":{"v":251.99999999999997,"d":"252"}},388,205,20,40,90,{"v":0,"d":"0%"},60,1.5,9.5,2.8,4.8,{"v":14,"d":"14.0"},"...",100,null,"",90,205,{"v":0.15,"d":"15%"},30.75,20,{"v":0.7050000000000001,"d":"0.705"}]
[null,"Maiskobs",890,{"v":6.57,"d":"6.6"},{"v":10.85,"d":"10.9"},85,{"v":0.3,"d":"30%"},134,-8,0.36,{"$f":"1.1*Q220","v":{"v":209.00000000000003,"d":"209"}},{"$f":"2*Q220","v":380},454,400,15,25,190,{"v":0,"d":"0%"},56,{"v":2,"d":"2.0"},2.1,0.3,1.3,{"v":11,"d":"11.0"},"...","...",null,"",190,400,{"v":0.3,"d":"30%"},120,15,{"v":0.51,"d":"0.510"}]
[null,"Malzkeime",920,5.9,{"v":10,"d":"10.0"},297,{"v":0.25,"d":"25%"},179,"+19",0.28,{"$f":"181/1.06","v":{"v":170.75471698113208,"d":"171"}},{"$f":"433/1.06","v":{"v":408.49056603773585,"d":"408"}},{"v":226.50943396226415,"d":"227"},46,139,11,150,{"v":0,"d":"0%"},57,0.7,5.6,0.5,0.4,2.6,"...","...",null,"",150,46,{"v":0.1,"d":"10%"},{"$f":"+AD221*AE221","v":4.6000000000000005},139,{"$f":"0.9-1.3*AE221","v":{"v":0.77,"d":"0.770"}}]
[null,"Melasse",786,7.6,11.9,135,{"v":0.2,"d":"20%"},153,-3,{"v":-0.4,"d":"-0.40"},0,0,746,0,652,3,5,{"v":0,"d":"0%"},116,2.5,0.5,7.6,0.2,54.1,"...",1150,null,"",5,{"$f":"IF(N222=0,0.0001,N222)","v":1E-4},{"v":1,"d":"100%"},1E-4,652,{"v":-0.4,"d":"-0.400"}]
[null,"Melasseschnitzel",900,7.7,12.2,97,{"v":0.3,"d":"30%"},150,-8,0.24,184,315,504,0,200,8,146,{"v":0,"d":"0%"},76,10.6,0.8,1.7,1.8,14.4,"...",190,null,"",146,1E-4,{"v":1,"d":"100%"},1E-4,200,{"v":-0.4,"d":"-0.400"}]
[null,"Palmkernkuchen, 8-12 % Fett",910,{"v":7.47,"d":"7.5"},12.3,205,{"v":0.4,"d":"40%"},198,"+1",0.46,350,550,135,0,25,65,170,{"v":0,"d":"0%"},45,{"$f":"2.2/0.9","v":{"v":2.4444444444444446,"d":"2.4"}},6.6,{"$f":"0.48/0.9","v":{"v":0.5333333333333333,"d":"0.5"}},{"$f":"3/0.9","v":{"v":3.333333333333333,"d":"3.3"}},{"$f":"6.7/0.9","v":{"v":7.444444444444445,"d":"7.4"}},"...","...",null,"",170,1E-4,{"v":1,"d":"100%"},1E-4,25,{"v":-0.4,"d":"-0.400"}]
[null,"Rapsextraktionsschrot ",890,{"v":7.34,"d":"7.3"},{"v":12,"d":"12.0"},385,{"v":0.35,"d":"35%"},253,"+21",0.38,226,315,204,0,80,20,150,{"v":0,"d":"0%"},77,7.8,15.7,0.6,4.8,14.4,"...",-110,null,"",150,1E-4,{"v":1,"d":"100%"},1E-4,80,{"v":-0.4,"d":"-0.400"}]
[null,"Rapsextraktionsschrot, geschützt ",900,{"v":7.34,"d":"7.3"},{"$f":"D226/0.63","v":{"v":11.65079365079365,"d":"11.7"}},388,{"v":0.6,"d":"60%"},331,"+9",0.39,244,367,147,0,75,21,157,{"v":0,"d":"0%"},78,7.6,16.9,0.8,4.9,15.1,"...",-110,null,"",157,1E-4,{"v":1,"d":"100%"},{"$f":"+AD226*AE226","v":1E-4},75,{"v":-0.4,"d":"-0.400"}]
[null,"Rapskuchen /-expeller , 15% Fett, kaltgepresst",900,{"v":8.72,"d":"8.7"},{"v":14.19,"d":"14.2"},340,{"v":0.15,"d":"15%"},207,"+21",0.37,{"$f":"1.9*Q227","v":{"v":237.5,"d":"238"}},{"$f":"2.2*Q227","v":275},150,0,70,165,125,{"v":0,"d":"0%"},70,7.5,11.6,0.4,5.1,{"v":13,"d":"13.0"},"...",-200,null,"",125,1E-4,{"v":1,"d":"100%"},1E-4,70,{"v":-0.4,"d":"-0.400"}]
[null,"Roggen, Körner",880,{"v":8.49,"d":"8.5"},13.3,105,{"v":0.15,"d":"15%"},161,-9,-0.21,{"$f":"1.5*Q228","v":{"v":37.5,"d":"38"}},{"$f":"2.2*Q228","v":{"v":55.00000000000001,"d":"55"}},801,640,70,20,25,{"v":0,"d":"0%"},19,0.9,3.3,0.3,1.4,{"v":6,"d":"6.0"},"...",45,null,"",25,640,{"v":0.1,"d":"10%"},64,70,{"v":0.77,"d":"0.770"}]
[null,"Sojabohne, Samen, dampferhitzt",900,9.9,{"v":15.89,"d":"15.9"},400,{"v":0.2,"d":"20%"},250,"+24",0.25,{"$f":"1.8*Q229","v":108},{"$f":"2.2*Q229","v":132},214,60,80,200,60,{"v":0,"d":"0%"},54,2.9,7.1,0.2,3.7,{"v":20,"d":"20.0"},"...","...",null,"",60,60,{"v":0.1,"d":"10%"},6,80,{"v":0.77,"d":"0.770"}]
[null,"Sojaextraktionsschrot - ungeschälte Saat, dampferhitzt",880,{"v":8.44,"d":"8.4"},{"v":13.49,"d":"13.5"},477,{"v":0.3,"d":"30%"},281,"+31",0.25,{"$f":"1.33*Q230","v":{"v":119.7,"d":"120"}},{"$f":"2.5*Q230","v":225},216,70,105,15,90,{"v":0,"d":"0%"},67,3.6,7.4,0.4,3.7,{"v":25,"d":"25.0"},"...",330,null,"",90,70,{"v":0.15,"d":"15%"},10.5,105,{"v":0.7050000000000001,"d":"0.705"}]
[null,"Sojaextraktionsschrot (gesch.) ",880,{"v":8.64,"d":"8.6"},{"v":13.76,"d":"13.8"},500,{"v":0.65,"d":"65%"},438,"+10",0.23,{"$f":"1.7*Q231","v":119},{"$f":"2.9*Q231","v":203},224,70,105,15,70,{"v":0,"d":"0%"},58,3.1,{"v":7,"d":"7.0"},0.2,{"v":3,"d":"3.0"},{"v":22,"d":"22.0"},"...",325,null,"",70,70,{"v":0.15,"d":"15%"},10.5,105,{"v":0.7050000000000001,"d":"0.705"}]
[null,"Sojaextraktionsschrot (HP) - geschälte Saat, dampferhitzt",890,{"v":8.56,"d":"8.6"},{"v":13.68,"d":"13.7"},545,{"v":0.3,"d":"30%"},304,"+39",0.19,{"$f":"1.3*Q232","v":52},{"$f":"2.2*Q232","v":88},285,75,110,15,40,{"v":0,"d":"0%"},67,{"$f":"3/0.89","v":{"v":3.3707865168539324,"d":"3.4"}},{"$f":"7.1/0.89","v":{"v":7.97752808988764,"d":"8.0"}},{"$f":"0.16/0.89","v":{"v":0.1797752808988764,"d":"0.2"}},{"$f":"2.6/0.89","v":{"v":2.9213483146067416,"d":"2.9"}},{"$f":"21.6/0.89","v":{"v":24.269662921348317,"d":"24.3"}},"...",325,null,"",40,75,{"v":0.15,"d":"15%"},11.25,110,{"v":0.7050000000000001,"d":"0.705"}]
[null,"Sonnenblumenextraktionsschrot, teilgesch.",900,{"v":6.01,"d":"6.0"},{"v":10.24,"d":"10.2"},383,{"v":0.25,"d":"25%"},203,"+29",0.45,{"$f":"1.2*Q233","v":264},{"$f":"1.8*Q233","v":396},126,0,80,25,220,{"v":0,"d":"0%"},70,{"$f":"3.6/0.9","v":{"v":4,"d":"4.0"}},10.7,0.5,{"$f":"4.7/0.9","v":{"v":5.222222222222222,"d":"5.2"}},{"$f":"11.7/0.9","v":{"v":12.999999999999998,"d":"13.0"}},"...","...",null,"",220,1E-4,{"v":1,"d":"100%"},1E-4,80,{"v":-0.4,"d":"-0.400"}]
[null,"Triticale, Körner",880,{"v":8.37,"d":"8.4"},{"v":13.17,"d":"13.2"},120,{"v":0.15,"d":"15%"},162,-7,{"v":-0.2,"d":"-0.20"},{"$f":"1.5*Q234","v":{"v":37.5,"d":"38"}},{"$f":"4.75*Q234","v":{"v":118.75,"d":"119"}},{"v":719.25,"d":"719"},660,45,20,25,{"v":0,"d":"0%"},22,{"$f":"0.4/0.88","v":{"v":0.4545454545454546,"d":"0.5"}},{"$f":"3.8/0.88","v":{"v":4.318181818181818,"d":"4.3"}},{"$f":"0.1/0.88","v":{"v":0.11363636363636365,"d":"0.1"}},{"$f":"1.1/0.88","v":{"v":1.25,"d":"1.3"}},{"$f":"4.7/0.88","v":{"v":5.340909090909091,"d":"5.3"}},"...",40,null,"",25,660,{"v":0.1,"d":"10%"},66,45,{"v":0.77,"d":"0.770"}]
[null,"Weizen (Winter), Körner",880,8.6,{"$f":"D235/0.63","v":{"v":13.65079365079365,"d":"13.7"}},150,{"v":0.2,"d":"20%"},175,-4,-0.19,84,157,643,670,35,28,30,{"v":0,"d":"0%"},22,0.9,5.8,0.1,1.4,6.1,"...",15,null,"",30,670,{"v":0.1,"d":"10%"},67,35,{"v":0.77,"d":"0.770"}]
[null,"Weizennachmehl",880,{"$f":"7.8/0.88","v":{"v":8.863636363636363,"d":"8.9"}},{"$f":"D236/0.6","v":{"v":14.772727272727273,"d":"14.8"}},{"$f":"166/0.88","v":{"v":188.63636363636363,"d":"189"}},{"v":0.2,"d":"20%"},195,-1,-0.26,{"$f":"21/0.88","v":{"v":23.863636363636363,"d":"24"}},{"$f":"51/0.88","v":{"v":57.95454545454545,"d":"58"}},{"v":701.1363636363636,"d":"701"},505,0,{"$f":"27/0.88","v":{"v":30.681818181818183,"d":"31"}},{"$f":"117.88","v":{"v":117.88,"d":"118"}},{"v":0,"d":"0%"},{"$f":"19/0.88","v":{"v":21.59090909090909,"d":"22"}},{"$f":"0.4/0.88","v":{"v":0.4545454545454546,"d":"0.5"}},{"$f":"3.8/0.88","v":{"v":4.318181818181818,"d":"4.3"}},{"$f":"0.04/0.88","v":{"v":0.045454545454545456,"d":"0.0"}},{"$f":"1.4/0.88","v":{"v":1.5909090909090908,"d":"1.6"}},{"$f":"4.2/0.88","v":{"v":4.7727272727272725,"d":"4.8"}},"...","...",null,null,117.88,800,{"v":0.05,"d":"5%"},40,0,0.835]
[null,"Weizenkleie",880,5.9,{"v":9.98,"d":"10.0"},160,{"v":0.25,"d":"25%"},143,"+3",0.27,{"$f":"1.1*Q237","v":{"v":148.5,"d":"149"}},{"$f":"3.8*Q237","v":513},217,145,65,45,135,{"v":0,"d":"0%"},65,1.8,{"v":13,"d":"13.0"},0.5,5.3,{"v":12,"d":"12.0"},"...","...",null,{"$f":"IF(COUNTA(B237:Y237)<21,\"x\",\"\")","v":""},135,{"$f":"IF(N237=0,0.0001,N237)","v":145},{"v":0.1,"d":"10%"},14.5,65,{"v":0.77,"d":"0.770"}]
[null,"Zitrustrester",900,7.6,{"$f":"D238/0.63","v":{"v":12.063492063492063,"d":"12.1"}},70,{"v":0.25,"d":"25%"},141,-11,0.18,{"$f":"1.1*Q238","v":154},{"$f":"1.6*Q238","v":224},609,0,245,35,140,{"v":0,"d":"0%"},62,18.8,{"$f":"1.2/0.9","v":{"v":1.3333333333333333,"d":"1.3"}},0.8,{"$f":"1.4/0.9","v":{"v":1.5555555555555554,"d":"1.6"}},{"v":9,"d":"9.0"},"...","...",null,{"$f":"IF(COUNTA(B238:Y238)<21,\"x\",\"\")","v":""},140,{"$f":"IF(N238=0,0.0001,N238)","v":1E-4},{"v":1,"d":"100%"},1E-4,245,-0.4]
[null,null,1E-3,0,0,0,0,0,0,0,0,0,0,0,0,0,0,0,0,0,0,0,0,0]
["Milchleistungsfutter (Bsp.)",null,1E-4,1E-4,1E-4,1E-4,1E-4,1E-4,1E-4,1E-4,1E-4,1E-4,1E-4,1E-4,1E-4,1E-4,1E-4,1E-4,1E-4,1E-4,1E-4,1E-4,1E-4,1E-4,1E-4]
[null,"MLF 14/3",880,7.5,{"v":12,"d":"12.0"},154,{"v":0.29,"d":"29%"},165,-2,0.13,132,265,488,327,80,24,104,{"v":0,"d":"0%"},69,8.7,7.1,1.7,2.5,10.2,"...","...",null,{"$f":"IF(COUNTA(B241:Y241)<21,\"x\",\"\")","v":""}]
[null,"MLF 18/3 getreidereich",890,7.6,12.2,208,{"v":0.26,"d":"26%"},186,{"v":3.4,"d":"3"},{"v":0.1,"d":"0.10"},128,244,451,358,62,26,90,{"v":0,"d":"0%"},72,6.4,10.2,3.5,3.3,11.9,"...","...",null,""]
[null,"MLF 18/3 getreidearm",890,7.5,12.1,205,{"v":0.28,"d":"28%"},186,{"v":3.1,"d":"3"},-0.01,144,250,434,189,100,28,101,{"v":0,"d":"0%"},83,9.1,8.8,4.4,3.5,13.3,"...","...",null,""]
[null,"MLF 18/3 nXP+",900,7.5,{"v":12,"d":"12.0"},205,{"v":0.3,"d":"30%"},194,{"v":1.9,"d":"2"},{"v":0.2,"d":"0.20"},146,255,429,189,100,28,101,{"v":0,"d":"0%"},83,9.1,8.9,4.4,3.5,13.4]
[null,"MLF 20/4 getreidereich",880,7.9,12.6,229,{"v":0.29,"d":"29%"},195,{"v":5.3,"d":"5"},{"v":0.1,"d":"0.10"},120,212,466,382,69,24,84,{"v":0,"d":"0%"},69,8.6,9.7,1.9,2.6,12.2]
[null,"MLF 20/4 getreidearm",890,7.9,12.6,223,{"v":0.29,"d":"29%"},194,{"v":4.7,"d":"5"},{"v":0.1,"d":"0.10"},122,205,471,263,116,24,84,{"v":0,"d":"0%"},77,11.3,{"v":8,"d":"8.0"},2.1,2.6,13.4]
[null,"MLF 20/4 nXP+",890,7.9,12.5,226,{"v":0.36,"d":"36%"},211,{"v":2.5,"d":"3"},{"v":0.2,"d":"0.20"},121,208,467,327,90,26,78,{"v":0,"d":"0%"},73,10.7,7.6,{"v":3,"d":"3.0"},4.2,12.1]
[null,"MLF 21/3",880,7.5,{"v":12,"d":"12.0"},234,{"v":0.28,"d":"28%"},193,7,0.17,146,268,398,215,81,24,107,{"v":0,"d":"0%"},76,9.6,7.2,2.8,{"v":4,"d":"4.0"},12.9,"...","...",null,""]
[null,"MLF 24/2 (Verschnitt m. Getreide 1:1)",880,6.9,11.2,269,{"v":0.31,"d":"31%"},198,12,0.34,202,351,263,17,92,29,145,{"v":0,"d":"0%"},90,10.7,9.1,3.5,5.1,13.8,"...","...",null,""]
[]
["Mineralfutter und Sonstige",null,1E-4,1E-4,1E-4,1E-4,1E-4,1E-4,1E-4,1E-4,1E-4,1E-4,1E-4,1E-4,1E-4,1E-4,1E-4,1E-4,1E-4,1E-4,1E-4,1E-4,1E-4,1E-4,1E-4]
[null,"Gesch. Fett (Ca-Seifen)",970,20.8,30.7,0,{"v":0,"d":"0%"},0,{"$f":"IF((F252-H252)/6.25<0,ROUND((F252-H252)/6.25,0),\"+\"&ROUND(((F252-H252)/6.25),0))","v":"+0"},{"v":1,"d":"1.00"},0,0,{"$f":"IF(AND(S252<>\"\",F252<>\"\",L252<>\"\",P252<>\"\"),1000-F252-L252-P252-S252,\"Fehler\")","v":0},0,0,875,0,{"v":0,"d":"0%"},125,80,0,0,0,0,"...","...",null,{"$f":"IF(COUNTA(B252:Y252)<21,\"x\",\"\")","v":""}]
[null,"Gesch. Fett (kristallin)",990,20.8,30.7,0,{"v":0,"d":"0%"},0,{"$f":"IF((F253-H253)/6.25<0,ROUND((F253-H253)/6.25,0),\"+\"&ROUND(((F253-H253)/6.25),0))","v":"+0"},{"v":1,"d":"1.00"},0,0,{"$f":"IF(AND(S253<>\"\",F253<>\"\",L253<>\"\",P253<>\"\"),1000-F253-L253-P253-S253,\"Fehler\")","v":0},0,0,1000,0,{"v":0,"d":"0%"},0,0,0,0,0,0,"...","..."]
[null,"Harnstoff",990,{"v":0,"d":"0.0"},{"v":0,"d":"0.0"},{"$f":"460*6.25","v":2875},{"v":0,"d":"0%"},0,"+460",{"v":1,"d":"1.00"},0,0,0,0,0,0,0,{"v":0,"d":"0%"},0,0,0,0,0,0,"...","...",null,{"$f":"IF(COUNTA(B254:Y254)<21,\"x\",\"\")","v":""}]
[null,"Kohlensaurer Futterkalk",960,{"v":0,"d":"0.0"},{"v":0,"d":"0.0"},0,{"v":0,"d":"0%"},0,"+0",{"v":1,"d":"1.00"},0,0,{"$f":"IF(AND(S255<>\"\",F255<>\"\",L255<>\"\",P255<>\"\"),1000-F255-L255-P255-S255,\"Fehler\")","v":0},0,0,0,0,{"v":0,"d":"0%"},1000,381,{"v":0.4,"d":"0"},0,{"v":1.6,"d":"2"},0,"...","...",null,{"$f":"IF(COUNTA(B255:Y255)<21,\"x\",\"\")","v":""}]
[null,"Mineralfutter 1/8",980,{"v":0,"d":"0.0"},{"v":0,"d":"0.0"},0,{"v":0,"d":"0%"},0,{"$f":"IF((F256-H256)/6.25<0,ROUND((F256-H256)/6.25,0),\"+\"&ROUND(((F256-H256)/6.25),0))","v":"+0"},{"v":1,"d":"1.00"},0,0,8,0,0,2,5,{"v":0,"d":"0%"},990,{"$f":"10/0.98","v":{"v":10.204081632653061,"d":"10"}},{"$f":"80/0.98","v":{"v":81.63265306122449,"d":"82"}},{"$f":"80/0.98","v":{"v":81.63265306122449,"d":"82"}},{"$f":"140/0.98","v":{"v":142.85714285714286,"d":"143"}},5,"...","..."]
[null,"Mineralfutter 10/12",980,{"v":0,"d":"0.0"},{"v":0,"d":"0.0"},0,{"v":0,"d":"0%"},0,{"$f":"IF((F257-H257)/6.25<0,ROUND((F257-H257)/6.25,0),\"+\"&ROUND(((F257-H257)/6.25),0))","v":"+0"},{"v":1,"d":"1.00"},0,0,8,0,0,2,5,{"v":0,"d":"0%"},990,{"$f":"100/0.98","v":{"v":102.04081632653062,"d":"102"}},{"$f":"120/0.98","v":{"v":122.44897959183673,"d":"122"}},106,{"$f":"32/0.98","v":{"v":32.6530612244898,"d":"33"}},5,"...","...",null,{"$f":"IF(COUNTA(B257:Y257)<21,\"x\",\"\")","v":""}]
[null,"Mineralfutter 14/7",980,{"v":0,"d":"0.0"},{"v":0,"d":"0.0"},0,{"v":0,"d":"0%"},0,{"$f":"IF((F258-H258)/6.25<0,ROUND((F258-H258)/6.25,0),\"+\"&ROUND(((F258-H258)/6.25),0))","v":"+0"},{"v":1,"d":"1.00"},0,0,8,0,0,2,5,{"v":0,"d":"0%"},990,{"$f":"140/0.98","v":{"v":142.85714285714286,"d":"143"}},{"$f":"70/0.98","v":{"v":71.42857142857143,"d":"71"}},{"$f":"106/0.98","v":{"v":108.16326530612245,"d":"108"}},{"$f":"32/0.98","v":{"v":32.6530612244898,"d":"33"}},5,"...","...",null,{"$f":"IF(COUNTA(B258:Y258)<21,\"x\",\"\")","v":""}]
[null,"Mineralfutter 20/0",980,{"v":0,"d":"0.0"},{"v":0,"d":"0.0"},0,{"v":0,"d":"0%"},0,{"$f":"IF((F259-H259)/6.25<0,ROUND((F259-H259)/6.25,0),\"+\"&ROUND(((F259-H259)/6.25),0))","v":"+0"},{"v":1,"d":"1.00"},0,0,{"$f":"IF(AND(S259<>\"\",F259<>\"\",L259<>\"\",P259<>\"\"),1000-F259-L259-P259-S259,\"Fehler\")","v":8},0,0,2,5,{"v":0,"d":"0%"},990,{"$f":"200/0.98","v":{"v":204.08163265306123,"d":"204"}},0,{"$f":"90/0.98","v":{"v":91.83673469387756,"d":"92"}},{"$f":"60/0.98","v":{"v":61.224489795918366,"d":"61"}},5]
[null,"Mineralfutter 22/7",980,{"v":0,"d":"0.0"},{"v":0,"d":"0.0"},0,{"v":0,"d":"0%"},0,"+0",{"v":1,"d":"1.00"},0,0,8,0,0,2,5,{"v":0,"d":"0%"},990,{"$f":"220/0.98","v":{"v":224.48979591836735,"d":"224"}},{"$f":"70/0.98","v":{"v":71.42857142857143,"d":"71"}},{"$f":"53/0.98","v":{"v":54.08163265306123,"d":"54"}},{"$f":"11/0.98","v":{"v":11.224489795918368,"d":"11"}},5,"...","...",null,{"$f":"IF(COUNTA(B260:Y260)<21,\"x\",\"\")","v":""}]
[null,"Mineralfutter 25/0",980,{"v":0,"d":"0.0"},{"v":0,"d":"0.0"},0,{"v":0,"d":"0%"},0,{"$f":"IF((F261-H261)/6.25<0,ROUND((F261-H261)/6.25,0),\"+\"&ROUND(((F261-H261)/6.25),0))","v":"+0"},{"v":1,"d":"1.00"},0,0,8,0,0,2,5,{"v":0,"d":"0%"},990,{"$f":"250/0.98","v":{"v":255.10204081632654,"d":"255"}},{"$f":"0/0.98","v":0},{"$f":"90/0.98","v":{"v":91.83673469387756,"d":"92"}},{"$f":"65/0.98","v":{"v":66.3265306122449,"d":"66"}},5,"...","..."]
[null,"Natriumbicarbonat",999,{"v":0,"d":"0.0"},{"v":0,"d":"0.0"},0,{"v":0,"d":"0%"},{"$f":"ROUND((11.93-(6.82*G262))*E262+1.03*G262*F262,0)","v":0},"+0",{"v":7,"d":"7.00"},0,0,0,0,0,0,5,{"v":0,"d":"0%"},1000,0,0,270,0,0,"...","...",null,{"$f":"IF(COUNTA(B262:Y262)<21,\"x\",\"\")","v":""}]
[null,"Propylenglycol",990,9.8,14.7,0,{"v":0,"d":"0%"},{"$f":"ROUND((11.93-(6.82*G263))*E263+1.03*G263*F263,0)","v":175},-28,-0.35,0,0,0,0,0,0,0,{"v":0,"d":"0%"},0,0,0,0,0,0,"...","...",null,{"$f":"IF(COUNTA(B263:Y263)<21,\"x\",\"\")","v":""}]
[null,"Reinglycerin",998,10.5,15.9,0,{"v":1,"d":"100%"},{"$f":"ROUND((11.93-(6.82*G264))*E264+1.03*G264*F264,0)","v":81},{"$f":"IF((F264-H264)/6.25<0,ROUND((F264-H264)/6.25,0),\"+\"&ROUND(((F264-H264)/6.25),0))","v":-13},-0.35,0,0,0,0,855,94,0,{"v":0,"d":"0%"},50,0,0,18,0,0,"...","..."]
[null,"Rohglycerin",880,8.4,13.1,0,{"v":1,"d":"100%"},{"$f":"ROUND((11.93-(6.82*G265))*E265+1.03*G265*F265,0)","v":67},-11,-0.35,0,0,0,0,855,95,0,{"v":0,"d":"0%"},50,0,0,18,0,0,"...","...",null,{"$f":"IF(COUNTA(B265:Y265)<21,\"x\",\"\")","v":""}]
[null,"Viehsalz",940,{"v":0,"d":"0.0"},{"v":0,"d":"0.0"},0,{"v":0,"d":"0%"},0,"+0",{"v":1,"d":"1.00"},0,0,{"$f":"IF(AND(S266<>\"\",F266<>\"\",L266<>\"\",P266<>\"\"),1000-F266-L266-P266-S266,\"Fehler\")","v":0},0,0,0,0,{"v":0,"d":"0%"},1000,0,0,354,0,32,"...","...",null,{"$f":"IF(COUNTA(B266:Y266)<21,\"x\",\"\")","v":""}]
[null,null,1E-3,0,0,0,0,0,0,0,0,0,0,0,null,null,0,0,0,0,0,0,0,0,{"$nulls":3},{"$f":"IF(COUNTA(B267:Y267)<21,\"x\",\"\")","v":"x"}]
[{"$f":"'Zuteilung-Milchleistungsfutter'!$A$50","v":"UniRat 2022, © W. Sekul, LAZBW Aulendorf             Die Daten sind auf Plausibilität zu prüfen, um Eingabe- und Berechnungsfehler auszuschließen. Es wird keine Gewähr zur Richtigkeit der Daten übernommen."}]

{"sheet":"Eigenmischungen","index":3,"n_rows":52,"n_cols":37,"rows_kept":52,"merged":[[1,1,1,2]]}
[]
[null,"Komponenten",null,{"$f":"Futterwerte!C6","v":"TS"},{"$f":"Futterwerte!D6","v":"NEL"},{"$f":"Futterwerte!E6","v":"ME"},{"$f":"Futterwerte!F6","v":"XP"},{"$f":"Futterwerte!G6","v":"UDP"},{"$f":"Futterwerte!H6","v":"nXP"},{"$f":"Futterwerte!I6","v":"RNB"},{"$f":"Futterwerte!J6","v":"SW"},{"$f":"Futterwerte!K6","v":"ADF"},{"$f":"Futterwerte!L6","v":"NDF"},{"$f":"Futterwerte!M6","v":"NFC"},{"$f":"Futterwerte!N6","v":"XS"},{"$f":"Futterwerte!O6","v":"XZ"},{"$f":"Futterwerte!P6","v":"XL"},{"$f":"Futterwerte!Q6","v":"XF"},{"$f":"Futterwerte!R6","v":"sXF"},{"$f":"Futterwerte!S6","v":"XA"},{"$f":"Futterwerte!T6","v":"Ca"},{"$f":"Futterwerte!U6","v":"P"},{"$f":"Futterwerte!V6","v":"Na"},{"$f":"Futterwerte!W6","v":"Mg"},{"$f":"Futterwerte!X6","v":"K"},{"$f":"Futterwerte!Y6","v":"Se"},{"$f":"Futterwerte!Z6","v":"DCAB"},{"$f":"Futterwerte!AA6","v":"Kosten"},"Mischung ...","Mischung ...","Mischung ...","Mischung ...","Mischung ...","Mischung ...","Mischung ...","Mischung ...","Mischung ..."]
[233,{"$f":"INDEX(Tabelle,$A3,1)","v":0},null,{"$f":"IF(INDEX(Tabelle,$A3,2)=\"\",\"\",INDEX(Tabelle,$A3,2)/10)","v":{"v":1e-05,"d":"0.0"}},{"$f":"INDEX(Tabelle,$A3,3)","v":{"v":1E-4,"d":"0.0"}},{"$f":"INDEX(Tabelle,$A3,4)","v":{"v":1E-4,"d":"0.0"}},{"$f":"INDEX(Tabelle,$A3,5)","v":{"v":1E-4,"d":"0.0"}},{"$f":"INDEX(Tabelle,$A3,6)","v":{"v":1E-4,"d":"0.0"}},{"$f":"INDEX(Tabelle,$A3,7)","v":{"v":1E-4,"d":"0.0"}},{"$f":"INDEX(Tabelle,$A3,8)","v":{"v":1E-4,"d":"0.0"}},{"$f":"INDEX(Tabelle,$A3,9)","v":{"v":1E-4,"d":"0.0"}},{"$f":"INDEX(Tabelle,$A3,10)","v":{"v":1E-4,"d":"0.0"}},{"$f":"INDEX(Tabelle,$A3,11)","v":{"v":1E-4,"d":"0.0"}},{"$f":"INDEX(Tabelle,$A3,12)","v":{"v":1E-4,"d":"0.0"}},{"$f":"INDEX(Tabelle,$A3,13)","v":{"v":1E-4,"d":"0.0"}},{"$f":"INDEX(Tabelle,$A3,14)","v":{"v":1E-4,"d":"0.0"}},{"$f":"INDEX(Tabelle,$A3,15)","v":{"v":1E-4,"d":"0.0"}},{"$f":"INDEX(Tabelle,$A3,16)","v":{"v":1E-4,"d":"0.0"}},{"$f":"INDEX(Tabelle,$A3,17)","v":{"v":1E-4,"d":"0.0"}},{"$f":"INDEX(Tabelle,$A3,18)","v":{"v":1E-4,"d":"0.0"}},{"$f":"INDEX(Tabelle,$A3,19)","v":{"v":1E-4,"d":"0.0"}},{"$f":"INDEX(Tabelle,$A3,20)","v":{"v":1E-4,"d":"0.0"}},{"$f":"INDEX(Tabelle,$A3,21)","v":{"v":1E-4,"d":"0.0"}},{"$f":"INDEX(Tabelle,$A3,22)","v":{"v":1E-4,"d":"0.0"}},{"$f":"INDEX(Tabelle,$A3,23)","v":{"v":1E-4,"d":"0.0"}},{"$f":"INDEX(Tabelle,$A3,24)","v":{"v":1E-4,"d":"0.0"}},{"$f":"INDEX(Tabelle,$A3,25)","v":{"v":0,"d":"0.0"}},{"$f":"INDEX(Tabelle,$A3,26)","v":{"v":0,"d":"0.0"}}]
[233,0,null,{"v":1e-05,"d":"0.0"},{"v":1E-4,"d":"0.0"},{"v":1E-4,"d":"0.0"},{"v":1E-4,"d":"0.0"},{"v":1E-4,"d":"0.0"},{"v":1E-4,"d":"0.0"},{"v":1E-4,"d":"0.0"},{"v":1E-4,"d":"0.0"},{"v":1E-4,"d":"0.0"},{"v":1E-4,"d":"0.0"},{"v":1E-4,"d":"0.0"},{"v":1E-4,"d":"0.0"},{"v":1E-4,"d":"0.0"},{"v":1E-4,"d":"0.0"},{"v":1E-4,"d":"0.0"},{"v":1E-4,"d":"0.0"},{"v":1E-4,"d":"0.0"},{"v":1E-4,"d":"0.0"},{"v":1E-4,"d":"0.0"},{"v":1E-4,"d":"0.0"},{"v":1E-4,"d":"0.0"},{"v":1E-4,"d":"0.0"},{"v":1E-4,"d":"0.0"},{"v":0,"d":"0.0"},{"v":0,"d":"0.0"}]
[193,0,null,{"v":1e-05,"d":"0.0"},{"v":1E-4,"d":"0.0"},{"v":1E-4,"d":"0.0"},{"v":1E-4,"d":"0.0"},{"v":1E-4,"d":"0.0"},{"v":1E-4,"d":"0.0"},{"v":1E-4,"d":"0.0"},{"v":1E-4,"d":"0.0"},{"v":1E-4,"d":"0.0"},{"v":1E-4,"d":"0.0"},{"v":1E-4,"d":"0.0"},{"v":1E-4,"d":"0.0"},{"v":1E-4,"d":"0.0"},{"v":1E-4,"d":"0.0"},{"v":1E-4,"d":"0.0"},{"v":1E-4,"d":"0.0"},{"v":1E-4,"d":"0.0"},{"v":1E-4,"d":"0.0"},{"v":1E-4,"d":"0.0"},{"v":1E-4,"d":"0.0"},{"v":1E-4,"d":"0.0"},{"v":1E-4,"d":"0.0"},{"v":1E-4,"d":"0.0"},{"v":0,"d":"0.0"},{"v":0,"d":"0.0"}]
[193,0,null,{"v":1e-05,"d":"0.0"},{"v":1E-4,"d":"0.0"},{"v":1E-4,"d":"0.0"},{"v":1E-4,"d":"0.0"},{"v":1E-4,"d":"0.0"},{"v":1E-4,"d":"0.0"},{"v":1E-4,"d":"0.0"},{"v":1E-4,"d":"0.0"},{"v":1E-4,"d":"0.0"},{"v":1E-4,"d":"0.0"},{"v":1E-4,"d":"0.0"},{"v":1E-4,"d":"0.0"},{"v":1E-4,"d":"0.0"},{"v":1E-4,"d":"0.0"},{"v":1E-4,"d":"0.0"},{"v":1E-4,"d":"0.0"},{"v":1E-4,"d":"0.0"},{"v":1E-4,"d":"0.0"},{"v":1E-4,"d":"0.0"},{"v":1E-4,"d":"0.0"},{"v":1E-4,"d":"0.0"},{"v":1E-4,"d":"0.0"},{"v":1E-4,"d":"0.0"},{"v":0,"d":"0.0"},{"v":0,"d":"0.0"}]
[193,0,null,{"v":1e-05,"d":"0.0"},{"v":1E-4,"d":"0.0"},{"v":1E-4,"d":"0.0"},{"v":1E-4,"d":"0.0"},{"v":1E-4,"d":"0.0"},{"v":1E-4,"d":"0.0"},{"v":1E-4,"d":"0.0"},{"v":1E-4,"d":"0.0"},{"v":1E-4,"d":"0.0"},{"v":1E-4,"d":"0.0"},{"v":1E-4,"d":"0.0"},{"v":1E-4,"d":"0.0"},{"v":1E-4,"d":"0.0"},{"v":1E-4,"d":"0.0"},{"v":1E-4,"d":"0.0"},{"v":1E-4,"d":"0.0"},{"v":1E-4,"d":"0.0"},{"v":1E-4,"d":"0.0"},{"v":1E-4,"d":"0.0"},{"v":1E-4,"d":"0.0"},{"v":1E-4,"d":"0.0"},{"v":1E-4,"d":"0.0"},{"v":1E-4,"d":"0.0"},{"v":0,"d":"0.0"},{"v":0,"d":"0.0"}]
[193,0,null,{"v":1e-05,"d":"0.0"},{"v":1E-4,"d":"0.0"},{"v":1E-4,"d":"0.0"},{"v":1E-4,"d":"0.0"},{"v":1E-4,"d":"0.0"},{"v":1E-4,"d":"0.0"},{"v":1E-4,"d":"0.0"},{"v":1E-4,"d":"0.0"},{"v":1E-4,"d":"0.0"},{"v":1E-4,"d":"0.0"},{"v":1E-4,"d":"0.0"},{"v":1E-4,"d":"0.0"},{"v":1E-4,"d":"0.0"},{"v":1E-4,"d":"0.0"},{"v":1E-4,"d":"0.0"},{"v":1E-4,"d":"0.0"},{"v":1E-4,"d":"0.0"},{"v":1E-4,"d":"0.0"},{"v":1E-4,"d":"0.0"},{"v":1E-4,"d":"0.0"},{"v":1E-4,"d":"0.0"},{"v":1E-4,"d":"0.0"},{"v":1E-4,"d":"0.0"},{"v":0,"d":"0.0"},{"v":0,"d":"0.0"}]
[193,0,null,{"v":1e-05,"d":"0.0"},{"v":1E-4,"d":"0.0"},{"v":1E-4,"d":"0.0"},{"v":1E-4,"d":"0.0"},{"v":1E-4,"d":"0.0"},{"v":1E-4,"d":"0.0"},{"v":1E-4,"d":"0.0"},{"v":1E-4,"d":"0.0"},{"v":1E-4,"d":"0.0"},{"v":1E-4,"d":"0.0"},{"v":1E-4,"d":"0.0"},{"v":1E-4,"d":"0.0"},{"v":1E-4,"d":"0.0"},{"v":1E-4,"d":"0.0"},{"v":1E-4,"d":"0.0"},{"v":1E-4,"d":"0.0"},{"v":1E-4,"d":"0.0"},{"v":1E-4,"d":"0.0"},{"v":1E-4,"d":"0.0"},{"v":1E-4,"d":"0.0"},{"v":1E-4,"d":"0.0"},{"v":1E-4,"d":"0.0"},{"v":1E-4,"d":"0.0"},{"v":0,"d":"0.0"},{"v":0,"d":"0.0"}]
[193,0,null,{"v":1e-05,"d":"0.0"},{"v":1E-4,"d":"0.0"},{"v":1E-4,"d":"0.0"},{"v":1E-4,"d":"0.0"},{"v":1E-4,"d":"0.0"},{"v":1E-4,"d":"0.0"},{"v":1E-4,"d":"0.0"},{"v":1E-4,"d":"0.0"},{"v":1E-4,"d":"0.0"},{"v":1E-4,"d":"0.0"},{"v":1E-4,"d":"0.0"},{"v":1E-4,"d":"0.0"},{"v":1E-4,"d":"0.0"},{"v":1E-4,"d":"0.0"},{"v":1E-4,"d":"0.0"},{"v":1E-4,"d":"0.0"},{"v":1E-4,"d":"0.0"},{"v":1E-4,"d":"0.0"},{"v":1E-4,"d":"0.0"},{"v":1E-4,"d":"0.0"},{"v":1E-4,"d":"0.0"},{"v":1E-4,"d":"0.0"},{"v":1E-4,"d":"0.0"},{"v":0,"d":"0.0"},{"v":0,"d":"0.0"}]
[193,0,null,{"v":1e-05,"d":"0.0"},{"v":1E-4,"d":"0.0"},{"v":1E-4,"d":"0.0"},{"v":1E-4,"d":"0.0"},{"v":1E-4,"d":"0.0"},{"v":1E-4,"d":"0.0"},{"v":1E-4,"d":"0.0"},{"v":1E-4,"d":"0.0"},{"v":1E-4,"d":"0.0"},{"v":1E-4,"d":"0.0"},{"v":1E-4,"d":"0.0"},{"v":1E-4,"d":"0.0"},{"v":1E-4,"d":"0.0"},{"v":1E-4,"d":"0.0"},{"v":1E-4,"d":"0.0"},{"v":1E-4,"d":"0.0"},{"v":1E-4,"d":"0.0"},{"v":1E-4,"d":"0.0"},{"v":1E-4,"d":"0.0"},{"v":1E-4,"d":"0.0"},{"v":1E-4,"d":"0.0"},{"v":1E-4,"d":"0.0"},{"v":1E-4,"d":"0.0"},{"v":0,"d":"0.0"},{"v":0,"d":"0.0"}]
[193,0,null,{"v":1e-05,"d":"0.0"},{"v":1E-4,"d":"0.0"},{"v":1E-4,"d":"0.0"},{"v":1E-4,"d":"0.0"},{"v":1E-4,"d":"0.0"},{"v":1E-4,"d":"0.0"},{"v":1E-4,"d":"0.0"},{"v":1E-4,"d":"0.0"},{"v":1E-4,"d":"0.0"},{"v":1E-4,"d":"0.0"},{"v":1E-4,"d":"0.0"},{"v":1E-4,"d":"0.0"},{"v":1E-4,"d":"0.0"},{"v":1E-4,"d":"0.0"},{"v":1E-4,"d":"0.0"},{"v":1E-4,"d":"0.0"},{"v":1E-4,"d":"0.0"},{"v":1E-4,"d":"0.0"},{"v":1E-4,"d":"0.0"},{"v":1E-4,"d":"0.0"},{"v":1E-4,"d":"0.0"},{"v":1E-4,"d":"0.0"},{"v":1E-4,"d":"0.0"},{"v":0,"d":"0.0"},{"v":0,"d":"0.0"}]
[193,0,null,{"v":1e-05,"d":"0.0"},{"v":1E-4,"d":"0.0"},{"v":1E-4,"d":"0.0"},{"v":1E-4,"d":"0.0"},{"v":1E-4,"d":"0.0"},{"v":1E-4,"d":"0.0"},{"v":1E-4,"d":"0.0"},{"v":1E-4,"d":"0.0"},{"v":1E-4,"d":"0.0"},{"v":1E-4,"d":"0.0"},{"v":1E-4,"d":"0.0"},{"v":1E-4,"d":"0.0"},{"v":1E-4,"d":"0.0"},{"v":1E-4,"d":"0.0"},{"v":1E-4,"d":"0.0"},{"v":1E-4,"d":"0.0"},{"v":1E-4,"d":"0.0"},{"v":1E-4,"d":"0.0"},{"v":1E-4,"d":"0.0"},{"v":1E-4,"d":"0.0"},{"v":1E-4,"d":"0.0"},{"v":1E-4,"d":"0.0"},{"v":1E-4,"d":"0.0"},{"v":0,"d":"0.0"},{"v":0,"d":"0.0"}]
[193,0,null,{"v":1e-05,"d":"0.0"},{"v":1E-4,"d":"0.0"},{"v":1E-4,"d":"0.0"},{"v":1E-4,"d":"0.0"},{"v":1E-4,"d":"0.0"},{"v":1E-4,"d":"0.0"},{"v":1E-4,"d":"0.0"},{"v":1E-4,"d":"0.0"},{"v":1E-4,"d":"0.0"},{"v":1E-4,"d":"0.0"},{"v":1E-4,"d":"0.0"},{"v":1E-4,"d":"0.0"},{"v":1E-4,"d":"0.0"},{"v":1E-4,"d":"0.0"},{"v":1E-4,"d":"0.0"},{"v":1E-4,"d":"0.0"},{"v":1E-4,"d":"0.0"},{"v":1E-4,"d":"0.0"},{"v":1E-4,"d":"0.0"},{"v":1E-4,"d":"0.0"},{"v":1E-4,"d":"0.0"},{"v":1E-4,"d":"0.0"},{"v":1E-4,"d":"0.0"},{"v":0,"d":"0.0"},{"v":0,"d":"0.0"}]
[193,0,null,{"v":1e-05,"d":"0.0"},{"v":1E-4,"d":"0.0"},{"v":1E-4,"d":"0.0"},{"v":1E-4,"d":"0.0"},{"v":1E-4,"d":"0.0"},{"v":1E-4,"d":"0.0"},{"v":1E-4,"d":"0.0"},{"v":1E-4,"d":"0.0"},{"v":1E-4,"d":"0.0"},{"v":1E-4,"d":"0.0"},{"v":1E-4,"d":"0.0"},{"v":1E-4,"d":"0.0"},{"v":1E-4,"d":"0.0"},{"v":1E-4,"d":"0.0"},{"v":1E-4,"d":"0.0"},{"v":1E-4,"d":"0.0"},{"v":1E-4,"d":"0.0"},{"v":1E-4,"d":"0.0"},{"v":1E-4,"d":"0.0"},{"v":1E-4,"d":"0.0"},{"v":1E-4,"d":"0.0"},{"v":1E-4,"d":"0.0"},{"v":1E-4,"d":"0.0"},{"v":0,"d":"0.0"},{"v":0,"d":"0.0"}]
[193,0,null,{"v":1e-05,"d":"0.0"},{"v":1E-4,"d":"0.0"},{"v":1E-4,"d":"0.0"},{"v":1E-4,"d":"0.0"},{"v":1E-4,"d":"0.0"},{"v":1E-4,"d":"0.0"},{"v":1E-4,"d":"0.0"},{"v":1E-4,"d":"0.0"},{"v":1E-4,"d":"0.0"},{"v":1E-4,"d":"0.0"},{"v":1E-4,"d":"0.0"},{"v":1E-4,"d":"0.0"},{"v":1E-4,"d":"0.0"},{"v":1E-4,"d":"0.0"},{"v":1E-4,"d":"0.0"},{"v":1E-4,"d":"0.0"},{"v":1E-4,"d":"0.0"},{"v":1E-4,"d":"0.0"},{"v":1E-4,"d":"0.0"},{"v":1E-4,"d":"0.0"},{"v":1E-4,"d":"0.0"},{"v":1E-4,"d":"0.0"},{"v":1E-4,"d":"0.0"},{"v":0,"d":"0.0"},{"v":0,"d":"0.0"}]
[193,0,null,{"v":1e-05,"d":"0.0"},{"v":1E-4,"d":"0.0"},{"v":1E-4,"d":"0.0"},{"v":1E-4,"d":"0.0"},{"v":1E-4,"d":"0.0"},{"v":1E-4,"d":"0.0"},{"v":1E-4,"d":"0.0"},{"v":1E-4,"d":"0.0"},{"v":1E-4,"d":"0.0"},{"v":1E-4,"d":"0.0"},{"v":1E-4,"d":"0.0"},{"v":1E-4,"d":"0.0"},{"v":1E-4,"d":"0.0"},{"v":1E-4,"d":"0.0"},{"v":1E-4,"d":"0.0"},{"v":1E-4,"d":"0.0"},{"$f":"INDEX(Tabelle,$A18,18)","v":{"v":1E-4,"d":"0.0"}},{"v":1E-4,"d":"0.0"},{"v":1E-4,"d":"0.0"},{"v":1E-4,"d":"0.0"},{"v":1E-4,"d":"0.0"},{"v":1E-4,"d":"0.0"},{"v":1E-4,"d":"0.0"},{"v":0,"d":"0.0"},{"v":0,"d":"0.0"}]
[193,0,null,{"v":1e-05,"d":"0.0"},{"v":1E-4,"d":"0.0"},{"v":1E-4,"d":"0.0"},{"v":1E-4,"d":"0.0"},{"v":1E-4,"d":"0.0"},{"v":1E-4,"d":"0.0"},{"v":1E-4,"d":"0.0"},{"v":1E-4,"d":"0.0"},{"v":1E-4,"d":"0.0"},{"v":1E-4,"d":"0.0"},{"v":1E-4,"d":"0.0"},{"v":1E-4,"d":"0.0"},{"v":1E-4,"d":"0.0"},{"v":1E-4,"d":"0.0"},{"v":1E-4,"d":"0.0"},{"v":1E-4,"d":"0.0"},{"$f":"INDEX(Tabelle,$A18,18)","v":{"v":1E-4,"d":"0.0"}},{"v":1E-4,"d":"0.0"},{"v":1E-4,"d":"0.0"},{"v":1E-4,"d":"0.0"},{"v":1E-4,"d":"0.0"},{"v":1E-4,"d":"0.0"},{"v":1E-4,"d":"0.0"},{"v":0,"d":"0.0"},{"v":0,"d":"0.0"}]
[193,0,null,{"v":1e-05,"d":"0.0"},{"v":1E-4,"d":"0.0"},{"v":1E-4,"d":"0.0"},{"v":1E-4,"d":"0.0"},{"v":1E-4,"d":"0.0"},{"v":1E-4,"d":"0.0"},{"v":1E-4,"d":"0.0"},{"v":1E-4,"d":"0.0"},{"v":1E-4,"d":"0.0"},{"v":1E-4,"d":"0.0"},{"v":1E-4,"d":"0.0"},{"v":1E-4,"d":"0.0"},{"v":1E-4,"d":"0.0"},{"v":1E-4,"d":"0.0"},{"v":1E-4,"d":"0.0"},{"v":1E-4,"d":"0.0"},{"$f":"INDEX(Tabelle,$A19,18)","v":{"v":1E-4,"d":"0.0"}},{"v":1E-4,"d":"0.0"},{"v":1E-4,"d":"0.0"},{"v":1E-4,"d":"0.0"},{"v":1E-4,"d":"0.0"},{"v":1E-4,"d":"0.0"},{"v":1E-4,"d":"0.0"},{"v":0,"d":"0.0"},{"v":0,"d":"0.0"}]
[193,0,null,{"v":1e-05,"d":"0.0"},{"v":1E-4,"d":"0.0"},{"v":1E-4,"d":"0.0"},{"v":1E-4,"d":"0.0"},{"v":1E-4,"d":"0.0"},{"v":1E-4,"d":"0.0"},{"v":1E-4,"d":"0.0"},{"v":1E-4,"d":"0.0"},{"v":1E-4,"d":"0.0"},{"v":1E-4,"d":"0.0"},{"v":1E-4,"d":"0.0"},{"v":1E-4,"d":"0.0"},{"v":1E-4,"d":"0.0"},{"v":1E-4,"d":"0.0"},{"v":1E-4,"d":"0.0"},{"v":1E-4,"d":"0.0"},{"$f":"INDEX(Tabelle,$A20,18)","v":{"v":1E-4,"d":"0.0"}},{"v":1E-4,"d":"0.0"},{"v":1E-4,"d":"0.0"},{"v":1E-4,"d":"0.0"},{"v":1E-4,"d":"0.0"},{"v":1E-4,"d":"0.0"},{"v":1E-4,"d":"0.0"},{"v":0,"d":"0.0"},{"v":0,"d":"0.0"}]
[null,null,"Summe",{"$nulls":25},{"$f":"SUM(AC3:AC20)","v":{"v":0,"d":"0.0%"}},{"$f":"SUM(AD3:AD20)","v":{"v":0,"d":"0.0%"}},{"v":0,"d":"0.0%"},{"v":0,"d":"0.0%"},{"v":0,"d":"0.0%"},{"v":0,"d":"0.0%"},{"v":0,"d":"0.0%"},{"v":0,"d":"0.0%"},{"v":0,"d":"0.0%"}]
[]
[null,null,"ESt",{"$nulls":25},{"$f":"IF(AC24=0,\"\",IF(AC24<=6.45,\"II\",IF(AC24<=6.95,\"III\",\"IV\")))","v":""},{"$f":"IF(AD24=0,\"\",IF(AD24<=6.45,\"II\",IF(AD24<=6.95,\"III\",\"IV\")))","v":""},"","","","","","",""]
[null,null,"NEL MJ /kg FM",{"$nulls":25},{"$f":"AC28*AC27/100","v":{"v":0,"d":"0.00"}},{"$f":"AD28*AD27/100","v":{"v":0,"d":"0.00"}},{"v":0,"d":"0.00"},{"v":0,"d":"0.00"},{"v":0,"d":"0.00"},{"v":0,"d":"0.00"},{"v":0,"d":"0.00"},{"v":0,"d":"0.00"},{"v":0,"d":"0.00"}]
[null,null,"XP, g/kg FM",{"$nulls":25},{"$f":"AC30*AC27/100","v":0},{"$f":"AD30*AD27/100","v":0},0,0,0,0,0,0,0]
[null,null,"Kosten €/dt",{"$nulls":25},{"$f":"ROUND(AC$3*$AB$3+AC$4*$AB$4+AC$5*$AB$5+AC$6*$AB$6+AC$7*$AB$7+AC$8*$AB$8+AC$9*$AB$9+AC$10*$AB$10+AC$11*$AB$11+AC$12*$AB$12+AC$13*$AB$13+AC$14*$AB$14+AC$15*$AB$15+AC$16*$AB$16+AC$17*$AB$17+AC$18*$AB$18+AC$19*$AB$19+AC$20*$AB$20,2)","v":{"v":0,"d":"0.00"}},{"$f":"ROUND(AD$3*$AB$3+AD$4*$AB$4+AD$5*$AB$5+AD$6*$AB$6+AD$7*$AB$7+AD$8*$AB$8+AD$9*$AB$9+AD$10*$AB$10+AD$11*$AB$11+AD$12*$AB$12+AD$13*$AB$13+AD$14*$AB$14+AD$15*$AB$15+AD$16*$AB$16+AD$17*$AB$17+AD$18*$AB$18+AD$19*$AB$19+AD$20*$AB$20,-1)","v":{"v":0,"d":"0.00"}},{"v":0,"d":"0.00"},{"v":0,"d":"0.00"},{"v":0,"d":"0.00"},{"v":0,"d":"0.00"},{"v":0,"d":"0.00"},{"v":0,"d":"0.00"},{"v":0,"d":"0.00"}]
[null,null,{"$f":"D2&\", %\"","v":"TS, %"},{"$nulls":25},{"$f":"ROUND(AC$3*$D$3+AC$4*$D$4+AC$5*$D$5+AC$6*$D$6+AC$7*$D$7+AC$8*$D$8+AC$9*$D$9+AC$10*$D$10+AC$11*$D$11+AC$12*$D$12+AC$13*$D$13+AC$14*$D$14+AC$15*$D$15+AC$16*$D$16+AC$17*$D$17+AC$18*$D$18+AC$19*$D$19+AC$20*$D$20,1)","v":{"v":0,"d":"0.0"}},{"$f":"ROUND(AD$3*$D$3+AD$4*$D$4+AD$5*$D$5+AD$6*$D$6+AD$7*$D$7+AD$8*$D$8+AD$9*$D$9+AD$10*$D$10+AD$11*$D$11+AD$12*$D$12+AD$13*$D$13+AD$14*$D$14+AD$15*$D$15+AD$16*$D$16+AD$17*$D$17+AD$18*$D$18+AD$19*$D$19+AD$20*$D$20,1)","v":{"v":0,"d":"0.0"}},{"v":0,"d":"0.0"},{"v":0,"d":"0.0"},{"v":0,"d":"0.0"},{"v":0,"d":"0.0"},{"v":0,"d":"0.0"},{"v":0,"d":"0.0"},{"v":0,"d":"0.0"}]
[null,null,{"$f":"E2&\", MJ\"","v":"NEL, MJ"},{"$nulls":25},{"$f":"ROUND(AC$3*$E$3+AC$4*$E$4+AC$5*$E$5+AC$6*$E$6+AC$7*$E$7+AC$8*$E$8+AC$9*$E$9+AC$10*$E$10+AC$11*$E$11+AC$12*$E$12+AC$13*$E$13+AC$14*$E$14+AC$15*$E$15+AC$16*$E$16+AC$17*$E$17+AC$18*$E$18+AC$19*$E$19+AC$20*$E$20,1)","v":{"v":0,"d":"0.0"}},{"$f":"ROUND(AD$3*$E$3+AD$4*$E$4+AD$5*$E$5+AD$6*$E$6+AD$7*$E$7+AD$8*$E$8+AD$9*$E$9+AD$10*$E$10+AD$11*$E$11+AD$12*$E$12+AD$13*$E$13+AD$14*$E$14+AD$15*$E$15+AD$16*$E$16+AD$17*$E$17+AD$18*$E$18+AD$19*$E$19+AD$20*$E$20,1)","v":{"v":0,"d":"0.0"}},{"v":0,"d":"0.0"},{"v":0,"d":"0.0"},{"v":0,"d":"0.0"},{"v":0,"d":"0.0"},{"v":0,"d":"0.0"},{"v":0,"d":"0.0"},{"v":0,"d":"0.0"}]
[null,null,{"$f":"F2&\", MJ\"","v":"ME, MJ"},{"$nulls":25},{"$f":"AC$3*$F$3+AC$4*$F$4+AC$5*$F$5+AC$6*$F$6+AC$7*$F$7+AC$8*$F$8+AC$9*$F$9+AC$10*$F$10+AC$11*$F$11+AC$12*$F$12+AC$13*$F$13+AC$14*$F$14+AC$15*$F$15+AC$16*$F$16+AC$17*$F$17+AC$18*$F$18+AC$19*$F$19+AC$20*$F$20","v":{"v":0,"d":"0.0"}},{"v":0,"d":"0.0"},{"v":0,"d":"0.0"},{"v":0,"d":"0.0"},{"v":0,"d":"0.0"},{"v":0,"d":"0.0"},{"v":0,"d":"0.0"},{"v":0,"d":"0.0"},{"v":0,"d":"0.0"}]
[null,null,{"$f":"G2&\", g/kg TM\"","v":"XP, g/kg TM"},{"$nulls":25},{"$f":"AC$3*$G$3+AC$4*$G$4+AC$5*$G$5+AC$6*$G$6+AC$7*$G$7+AC$8*$G$8+AC$9*$G$9+AC$10*$G$10+AC$11*$G$11+AC$12*$G$12+AC$13*$G$13+AC$14*$G$14+AC$15*$G$15+AC$16*$G$16+AC$17*$G$17+AC$18*$G$18+AC$19*$G$19+AC$20*$G$20","v":0},0,0,0,0,0,0,0,0]
[null,null,{"$f":"H2","v":"UDP"},{"$nulls":25},{"$f":"AC$3*$H$3+AC$4*$H$4+AC$5*$H$5+AC$6*$H$6+AC$7*$H$7+AC$8*$H$8+AC$9*$H$9+AC$10*$H$10+AC$11*$H$11+AC$12*$H$12+AC$13*$H$13+AC$14*$H$14+AC$15*$H$15+AC$16*$H$16+AC$17*$H$17+AC$18*$H$18+AC$19*$H$19+AC$20*$H$20","v":{"v":0,"d":"0%"}},{"v":0,"d":"0%"},{"v":0,"d":"0%"},{"v":0,"d":"0%"},{"v":0,"d":"0%"},{"v":0,"d":"0%"},{"v":0,"d":"0%"},{"v":0,"d":"0%"},{"v":0,"d":"0%"}]
[null,null,{"$f":"I2&\", g/kg TM\"","v":"nXP, g/kg TM"},{"$nulls":25},{"$f":"AC$3*$I$3+AC$4*$I$4+AC$5*$I$5+AC$6*$I$6+AC$7*$I$7+AC$8*$I$8+AC$9*$I$9+AC$10*$I$10+AC$11*$I$11+AC$12*$I$12+AC$13*$I$13+AC$14*$I$14+AC$15*$I$15+AC$16*$I$16+AC$17*$I$17+AC$18*$I$18+AC$19*$I$19+AC$20*$I$20","v":0},0,0,0,0,0,0,0,0]
[null,null,{"$f":"J2&\", g/kg TM\"","v":"RNB, g/kg TM"},{"$nulls":25},{"$f":"AC$3*$J$3+AC$4*$J$4+AC$5*$J$5+AC$6*$J$6+AC$7*$J$7+AC$8*$J$8+AC$9*$J$9+AC$10*$J$10+AC$11*$J$11+AC$12*$J$12+AC$13*$J$13+AC$14*$J$14+AC$15*$J$15+AC$16*$J$16+AC$17*$J$17+AC$18*$J$18+AC$19*$J$19+AC$20*$J$20","v":{"v":0,"d":"0.0"}},{"v":0,"d":"0.0"},{"v":0,"d":"0.0"},{"v":0,"d":"0.0"},{"v":0,"d":"0.0"},{"v":0,"d":"0.0"},{"v":0,"d":"0.0"},{"v":0,"d":"0.0"},{"v":0,"d":"0.0"}]
[null,null,{"$f":"K2&\", g/kg TM\"","v":"SW, g/kg TM"},{"$nulls":25},{"$f":"AC$3*$K$3+AC$4*$K$4+AC$5*$K$5+AC$6*$K$6+AC$7*$K$7+AC$8*$K$8+AC$9*$K$9+AC$10*$K$10+AC$11*$K$11+AC$12*$K$12+AC$13*$K$13+AC$14*$K$14+AC$15*$K$15+AC$16*$K$16+AC$17*$K$17+AC$18*$K$18+AC$19*$K$19+AC$20*$K$20","v":{"v":0,"d":"0.0"}},{"v":0,"d":"0.0"},{"v":0,"d":"0.0"},{"v":0,"d":"0.0"},{"v":0,"d":"0.0"},{"v":0,"d":"0.0"},{"v":0,"d":"0.0"},{"v":0,"d":"0.0"},{"v":0,"d":"0.0"}]
[null,null,{"$f":"L2&\", g/kg TM\"","v":"ADF, g/kg TM"},{"$nulls":25},{"$f":"AC$3*$L$3+AC$4*$L$4+AC$5*$L$5+AC$6*$L$6+AC$7*$L$7+AC$8*$L$8+AC$9*$L$9+AC$10*$L$10+AC$11*$L$11+AC$12*$L$12+AC$13*$L$13+AC$14*$L$14+AC$15*$L$15+AC$16*$L$16+AC$17*$L$17+AC$18*$L$18+AC$19*$L$19+AC$20*$L$20","v":0},0,0,0,0,0,0,0,0]
[null,null,{"$f":"M2&\", g/kg TM\"","v":"NDF, g/kg TM"},{"$nulls":25},{"$f":"AC$3*$M$3+AC$4*$M$4+AC$5*$M$5+AC$6*$M$6+AC$7*$M$7+AC$8*$M$8+AC$9*$M$9+AC$10*$M$10+AC$11*$M$11+AC$12*$M$12+AC$13*$M$13+AC$14*$M$14+AC$15*$M$15+AC$16*$M$16+AC$17*$M$17+AC$18*$M$18+AC$19*$M$19+AC$20*$M$20","v":0},0,0,0,0,0,0,0,0]
[null,null,{"$f":"N2&\", g/kg TM\"","v":"NFC, g/kg TM"},{"$nulls":25},{"$f":"AC$3*$N$3+AC$4*$N$4+AC$5*$N$5+AC$6*$N$6+AC$7*$N$7+AC$8*$N$8+AC$9*$N$9+AC$10*$N$10+AC$11*$N$11+AC$12*$N$12+AC$13*$N$13+AC$14*$N$14+AC$15*$N$15+AC$16*$N$16+AC$17*$N$17+AC$18*$N$18+AC$19*$N$19+AC$20*$N$20","v":0},{"$f":"AD$3*$N$3+AD$4*$N$4+AD$5*$N$5+AD$6*$N$6+AD$7*$N$7+AD$8*$N$8+AD$9*$N$9+AD$10*$N$10+AD$11*$N$11+AD$12*$N$12+AD$13*$N$13+AD$14*$N$14+AD$15*$N$15+AD$16*$N$16+AD$17*$N$17+AD$18*$N$18+AD$19*$N$19+AD$20*$N$20","v":0},0,0,0,0,0,0,0]
[null,null,{"$f":"O2&\", g/kg TM\"","v":"XS, g/kg TM"},{"$nulls":25},{"$f":"AC$3*$O$3+AC$4*$O$4+AC$5*$O$5+AC$6*$O$6+AC$7*$O$7+AC$8*$O$8+AC$9*$O$9+AC$10*$O$10+AC$11*$O$11+AC$12*$O$12+AC$13*$O$13+AC$14*$O$14+AC$15*$O$15+AC$16*$O$16+AC$17*$O$17+AC$18*$O$18+AC$19*$O$19+AC$20*$O$20","v":0},{"$f":"AD$3*$O$3+AD$4*$O$4+AD$5*$O$5+AD$6*$O$6+AD$7*$O$7+AD$8*$O$8+AD$9*$O$9+AD$10*$O$10+AD$11*$O$11+AD$12*$O$12+AD$13*$O$13+AD$14*$O$14+AD$15*$O$15+AD$16*$O$16+AD$17*$O$17+AD$18*$O$18+AD$19*$O$19+AD$20*$O$20","v":0},0,0,0,0,0,0,0]
[null,null,{"$f":"P2&\", g/kg TM\"","v":"XZ, g/kg TM"},{"$nulls":25},{"$f":"AC$3*$P$3+AC$4*$P$4+AC$5*$P$5+AC$6*$P$6+AC$7*$P$7+AC$8*$P$8+AC$9*$P$9+AC$10*$P$10+AC$11*$P$11+AC$12*$P$12+AC$13*$P$13+AC$14*$P$14+AC$15*$P$15+AC$16*$P$16+AC$17*$P$17+AC$18*$P$18+AC$19*$P$19+AC$20*$P$20","v":0},0,0,0,0,0,0,0,0]
[null,null,{"$f":"Q2&\", g/kg TM\"","v":"XL, g/kg TM"},{"$nulls":25},{"$f":"AC$3*$Q$3+AC$4*$Q$4+AC$5*$Q$5+AC$6*$Q$6+AC$7*$Q$7+AC$8*$Q$8+AC$9*$Q$9+AC$10*$Q$10+AC$11*$Q$11+AC$12*$Q$12+AC$13*$Q$13+AC$14*$Q$14+AC$15*$Q$15+AC$16*$Q$16+AC$17*$Q$17+AC$18*$Q$18+AC$19*$Q$19+AC$20*$Q$20","v":0},0,0,0,0,0,0,0,0]
[null,null,{"$f":"R2&\", g/kg TM\"","v":"XF, g/kg TM"},{"$nulls":25},{"$f":"AC$3*$R$3+AC$4*$R$4+AC$5*$R$5+AC$6*$R$6+AC$7*$R$7+AC$8*$R$8+AC$9*$R$9+AC$10*$R$10+AC$11*$R$11+AC$12*$R$12+AC$13*$R$13+AC$14*$R$14+AC$15*$R$15+AC$16*$R$16+AC$17*$R$17+AC$18*$R$18+AC$19*$R$19+AC$20*$R$20","v":0},0,0,0,0,0,0,0,0]
[null,null,{"$f":"S2","v":"sXF"},{"$nulls":25},{"$f":"AC$3*$S$3+AC$4*$S$4+AC$5*$S$5+AC$6*$S$6+AC$7*$S$7+AC$8*$S$8+AC$9*$S$9+AC$10*$S$10+AC$11*$S$11+AC$12*$S$12+AC$13*$S$13+AC$14*$S$14+AC$15*$S$15+AC$16*$S$16+AC$17*$S$17+AC$18*$S$18+AC$19*$S$19+AC$20*$S$20","v":{"v":0,"d":"0%"}},{"v":0,"d":"0%"},{"v":0,"d":"0%"},{"v":0,"d":"0%"},{"v":0,"d":"0%"},{"v":0,"d":"0%"},{"v":0,"d":"0%"},{"v":0,"d":"0%"},{"v":0,"d":"0%"}]
[null,null,{"$f":"T2&\", g/kg TM\"","v":"XA, g/kg TM"},{"$nulls":25},{"$f":"AC$3*$T$3+AC$4*$T$4+AC$5*$T$5+AC$6*$T$6+AC$7*$T$7+AC$8*$T$8+AC$9*$T$9+AC$10*$T$10+AC$11*$T$11+AC$12*$T$12+AC$13*$T$13+AC$14*$T$14+AC$15*$T$15+AC$16*$T$16+AC$17*$T$17+AC$18*$T$18+AC$19*$T$19+AC$20*$T$20","v":0},0,0,0,0,0,0,0,0]
[null,null,{"$f":"U2&\", g/kg TM\"","v":"Ca, g/kg TM"},{"$nulls":25},{"$f":"AC$3*$U$3+AC$4*$U$4+AC$5*$U$5+AC$6*$U$6+AC$7*$U$7+AC$8*$U$8+AC$9*$U$9+AC$10*$U$10+AC$11*$U$11+AC$12*$U$12+AC$13*$U$13+AC$14*$U$14+AC$15*$U$15+AC$16*$U$16+AC$17*$U$17+AC$18*$U$18+AC$19*$U$19+AC$20*$U$20","v":{"v":0,"d":"0.0"}},{"v":0,"d":"0.0"},{"v":0,"d":"0.0"},{"v":0,"d":"0.0"},{"v":0,"d":"0.0"},{"v":0,"d":"0.0"},{"v":0,"d":"0.0"},{"v":0,"d":"0.0"},{"v":0,"d":"0.0"}]
[null,null,{"$f":"V2&\", g/kg TM\"","v":"P, g/kg TM"},{"$nulls":25},{"$f":"AC$3*$V$3+AC$4*$V$4+AC$5*$V$5+AC$6*$V$6+AC$7*$V$7+AC$8*$V$8+AC$9*$V$9+AC$10*$V$10+AC$11*$V$11+AC$12*$V$12+AC$13*$V$13+AC$14*$V$14+AC$15*$V$15+AC$16*$V$16+AC$17*$V$17+AC$18*$V$18+AC$19*$V$19+AC$20*$V$20","v":{"v":0,"d":"0.0"}},{"v":0,"d":"0.0"},{"v":0,"d":"0.0"},{"v":0,"d":"0.0"},{"v":0,"d":"0.0"},{"v":0,"d":"0.0"},{"v":0,"d":"0.0"},{"v":0,"d":"0.0"},{"v":0,"d":"0.0"}]
[null,null,{"$f":"W2&\", g/kg TM\"","v":"Na, g/kg TM"},{"$nulls":25},{"$f":"AC$3*$W$3+AC$4*$W$4+AC$5*$W$5+AC$6*$W$6+AC$7*$W$7+AC$8*$W$8+AC$9*$W$9+AC$10*$W$10+AC$11*$W$11+AC$12*$W$12+AC$13*$W$13+AC$14*$W$14+AC$15*$W$15+AC$16*$W$16+AC$17*$W$17+AC$18*$W$18+AC$19*$W$19+AC$20*$W$20","v":{"v":0,"d":"0.0"}},{"v":0,"d":"0.0"},{"v":0,"d":"0.0"},{"v":0,"d":"0.0"},{"v":0,"d":"0.0"},{"v":0,"d":"0.0"},{"v":0,"d":"0.0"},{"v":0,"d":"0.0"},{"v":0,"d":"0.0"}]
[null,null,{"$f":"X2&\", g/kg TM\"","v":"Mg, g/kg TM"},{"$nulls":25},{"$f":"AC$3*$X$3+AC$4*$X$4+AC$5*$X$5+AC$6*$X$6+AC$7*$X$7+AC$8*$X$8+AC$9*$X$9+AC$10*$X$10+AC$11*$X$11+AC$12*$X$12+AC$13*$X$13+AC$14*$X$14+AC$15*$X$15+AC$16*$X$16+AC$17*$X$17+AC$18*$X$18+AC$19*$X$19+AC$20*$X$20","v":{"v":0,"d":"0.0"}},{"v":0,"d":"0.0"},{"v":0,"d":"0.0"},{"v":0,"d":"0.0"},{"v":0,"d":"0.0"},{"v":0,"d":"0.0"},{"v":0,"d":"0.0"},{"v":0,"d":"0.0"},{"v":0,"d":"0.0"}]
[null,null,{"$f":"Y2&\", g/kg TM\"","v":"K, g/kg TM"},{"$nulls":25},{"$f":"AC$3*$Y$3+AC$4*$Y$4+AC$5*$Y$5+AC$6*$Y$6+AC$7*$Y$7+AC$8*$Y$8+AC$9*$Y$9+AC$10*$Y$10+AC$11*$Y$11+AC$12*$Y$12+AC$13*$Y$13+AC$14*$Y$14+AC$15*$Y$15+AC$16*$Y$16+AC$17*$Y$17+AC$18*$Y$18+AC$19*$Y$19+AC$20*$Y$20","v":{"v":0,"d":"0.0"}},{"$f":"AD$3*$Y$3+AD$4*$Y$4+AD$5*$Y$5+AD$6*$Y$6+AD$7*$Y$7+AD$8*$Y$8+AD$9*$Y$9+AD$10*$Y$10+AD$11*$Y$11+AD$12*$Y$12+AD$13*$Y$13+AD$14*$Y$14+AD$15*$Y$15+AD$16*$Y$16+AD$17*$Y$17+AD$18*$Y$18+AD$19*$Y$19+AD$20*$Y$20","v":{"v":0,"d":"0.0"}},{"$f":"AE$3*$Y$3+AE$4*$Y$4+AE$5*$Y$5+AE$6*$Y$6+AE$7*$Y$7+AE$8*$Y$8+AE$9*$Y$9+AE$10*$Y$10+AE$11*$Y$11+AE$12*$Y$12+AE$13*$Y$13+AE$14*$Y$14+AE$15*$Y$15+AE$16*$Y$16+AE$17*$Y$17+AE$18*$Y$18+AE$19*$Y$19+AE$20*$Y$20","v":{"v":0,"d":"0.0"}},{"v":0,"d":"0.0"},{"v":0,"d":"0.0"},{"v":0,"d":"0.0"},{"v":0,"d":"0.0"},{"v":0,"d":"0.0"},{"v":0,"d":"0.0"}]
[null,null,{"$f":"Z2&\", mg/kg TM\"","v":"Se, mg/kg TM"},{"$nulls":25},{"$f":"AC$3*$Z$3+AC$4*$Z$4+AC$5*$Z$5+AC$6*$Z$6+AC$7*$Z$7+AC$8*$Z$8+AC$9*$Z$9+AC$10*$Z$10+AC$11*$Z$11+AC$12*$Z$12+AC$13*$Z$13+AC$14*$Z$14+AC$15*$Z$15+AC$16*$Z$16+AC$17*$Z$17+AC$18*$Z$18+AC$19*$Z$19+AC$20*$Z$20","v":{"v":0,"d":"0.0"}},{"v":0,"d":"0.0"},{"v":0,"d":"0.0"},{"v":0,"d":"0.0"},{"v":0,"d":"0.0"},{"v":0,"d":"0.0"},{"v":0,"d":"0.0"},{"v":0,"d":"0.0"},{"v":0,"d":"0.0"}]
[null,null,{"$f":"AA2&\", mg/kg TM\"","v":"DCAB, mg/kg TM"},{"$nulls":25},{"$f":"AC$3*$AA$3+AC$4*$AA$4+AC$5*$AA$5+AC$6*$AA$6+AC$7*$AA$7+AC$8*$AA$8+AC$9*$AA$9+AC$10*$AA$10+AC$11*$AA$11+AC$12*$AA$12+AC$13*$AA$13+AC$14*$AA$14+AC$15*$AA$15+AC$16*$AA$16+AC$17*$AA$17+AC$18*$AA$18+AC$19*$AA$19+AC$20*$AA$20","v":{"v":0,"d":"0.0"}},{"$f":"AD$3*$AA$3+AD$4*$AA$4+AD$5*$AA$5+AD$6*$AA$6+AD$7*$AA$7+AD$8*$AA$8+AD$9*$AA$9+AD$10*$AA$10+AD$11*$AA$11+AD$12*$AA$12+AD$13*$AA$13+AD$14*$AA$14+AD$15*$AA$15+AD$16*$AA$16+AD$17*$AA$17+AD$18*$AA$18+AD$19*$AA$19+AD$20*$AA$20","v":{"v":0,"d":"0.0"}},{"v":0,"d":"0.0"},{"v":0,"d":"0.0"},{"v":0,"d":"0.0"},{"v":0,"d":"0.0"},{"v":0,"d":"0.0"},{"v":0,"d":"0.0"},{"v":0,"d":"0.0"}]
[]
[{"$f":"'Ration Milch-Mineralstoffe'!A42:U42","v":"UniRat 2022, © W. Sekul, LAZBW Aulendorf             Die Daten sind auf Plausibilität zu prüfen, um Eingabe- und Berechnungsfehler auszuschließen. Es wird keine Gewähr zur Richtigkeit der Daten übernommen."},{"$nulls":34},{"$f":"Einstellungen!C1","v":"Bearbeiter*in:"},{"$f":"Einstellungen!E1","v":"E. Gerster"}]

{"sheet":"Ration Milch","index":4,"n_rows":50,"n_cols":38,"rows_kept":50,"merged":[[1,24,1,26],[7,7,8,7],[11,12,11,22],[16,21,16,34]]}
[]
[{"$nulls":9},{"$f":"\"Futterberechnung für \"&IF(Art=1,\"Milchkühe\",IF(Art=2,\"Milchschafe\",IF(Art=3,\"Milchziegen\",\"\")))","v":"Futterberechnung für Milchkühe"}]
[null,null,1,null,null,2]
[{"$nulls":3},"Milchkühe",{"$nulls":3},"Dateneingabe"]
[{"$nulls":3},"Milchschafe",{"$nulls":3},1,"Trockenmasse"]
[{"$nulls":3},"Milchziegen",{"$nulls":4},"Frischmasse"]
[]
[{"$nulls":3},"Rationsbezeichnung","Rationsbezeichnung","Tierzahl","Laktationen","Laktations-tag","Gewicht","Milchleistung"]
[{"$nulls":9},"(trocken= \"T\")","Fett","Eiweiß",{"$nulls":10},{"$f":"\"Bedarf de\"&IF(Art=1,\"r Kuh\",IF(Art=2,\"s Schafes\",IF(Art=3,\"r Ziege\",\"\")))","v":"Bedarf der Kuh"}]
[{"$nulls":5},{"$f":"IF(Art=1,\"Holstein\",IF(Art=2,\"Milchschaf\",IF(Art=3,\"Milchziege\")))","v":"Holstein"},"Anzahl","Tage","kg","kg/Tag","%","%",{"$nulls":10},{"$f":"W18","v":"TM"},{"$f":"X18","v":"NEL"},"nXP","RNB","NFC","SW","ADF","NDF",{"$f":"AE18","v":"XS"},"XZ","XL","XF","sXF"]
[null,null,1,2,null,{"$f":"IF(Art=1,\"Fleckvieh\",\"\")","v":"Fleckvieh"},{"$nulls":16},"kg",{"$f":"H19","v":"MJ"},{"$f":"I19","v":"g"},"-20 bis \n+50 g",{"$f":"IF(W40=0,\"<\"&NFCmax&\"g/kg\",\"<\"&ROUND(W40*NFCmax,0)&\" g\")","v":"<400g/kg"},{"$f":"IF(Art=1,\">\"&SWmin,\"\")","v":">1,2"},{"$f":"IF(W40=0,\">\"&ADFmin,\">\"&ROUND(W40*ADFmin,0)&\" g\")","v":">200"},{"$f":"IF(V40=0,\">\"&NDFmin,\">\"&ROUND(W40*NDFmin,0)&\" g\")","v":">300"},{"$f":"IF($W$40=0,\"<\"&XSmax,\"<\"&ROUND($W$40*XSmax,0)&\" g\")","v":"<350"},{"$f":"IF($W$40=0,\"<\"&XSmax,\"<\"&ROUND($W$40*XSmax,0)&\" g\")","v":"<350"},{"$f":"IF($W$40=0,\"<\"&XLmax,\"<\"&ROUND($W$40*XLmax,0)&\" g\")","v":"<40"},{"$f":"IF($V$40=0,\">\"&XFmin,\">\"&ROUND($W$40*XFmin,0)&\" g\")","v":">160"},{"$f":"IF($V$40=0,\">\"&sXFmin,\">\"&ROUND($W$40*sXFmin,0)&\" g\")","v":">100"}]
[{"$nulls":5},{"$f":"IF(Art=1,\"Braunvieh\",\"\")","v":"Braunvieh"},{"$nulls":6},{"$f":"IF(Art=1,\"4,0 % Fett  3,4 %  Eiweiß   ->  3,28MJ NEL/kg, 85 g nXP\",\"\")","v":"4,0 % Fett  3,4 %  Eiweiß   ->  3,28MJ NEL/kg, 85 g nXP"},{"$nulls":10},{"$f":"ROUND(IF(OR(F_vH=0,E_vH=0),0,IF(M_kg=\"t\",0,IF(Art=1,F_vH*0.38+E_vH*0.21+1.05,IF(Art=2,(F_vH*0.38+E_vH*0.21+0.95)/0.63,IF(Art=3,(F_vH*0.38+E_vH*0.21+0.95)/0.63,\"\"))))),2)","v":{"v":0,"d":"0.00"}},{"$f":"ROUND(IF(M_kg=\"t\",0,IF(E_vH=0,0,IF(Art=1,(E_vH-3.4)*20+85,IF(Art=2,(E_vH-3.4)*20+85,IF(Art=3,(E_vH-3.4)*20+85,\"\"))))),0)","v":0},"je kg Milch","k",{"$f":"IF(TMR=1,2.274,3.878)","v":3.878},"LM",{"$f":"IF(TMR=1,LG*(0.0173-0.0000514*LaktTag+0.0000000999*LaktTag^2),LG*(0.0148-0.0000474*LaktTag+0.0000000904*LaktTag^2))","v":0}]
[null,null,"Leistungsbedarf",{"$nulls":4},{"$f":"IF(H11>36000,H11,TODAY()-H11)","v":45048},{"$nulls":15},{"$f":"ROUND(IF(Art=1,IF(M_kg=\"t\",13,M_kg*X12),IF(Art=2,IF(M_kg=\"t\",7,M_kg*X12),IF(Art=3,IF(M_kg=\"t\",3.8,M_kg*X12),\"\"))),1)","v":{"v":0,"d":"0.0"}},{"$f":"ROUND(IF(Art=1,IF(M_kg=\"t\",675,M_kg*Y12),IF(Art=2,IF(M_kg=\"t\",7,M_kg*Y12),IF(Art=3,IF(M_kg=\"t\",3.8,M_kg*Y12),\"\"))),0)","v":0},null,"Rasse",{"$f":"IF(TMR=1,IF(Rasse=1,-1.449,IF(Rasse=2,-2.169,-1.391)),IF(Rasse=1,-2.194,IF(Rasse=2,-2.631,-1.826)))","v":-2.631},"ECM",{"$f":"IF(M_kg=\"t\",0,IF(TMR=1,(1.05+0.38*F_vH+0.21*E_vH)/3.28*M_kg*(0.201+0.000808*LaktTag-0.000001299*LaktTag^2),(1.05+0.38*F_vH+0.21*E_vH)/3.28*M_kg*(0.0825+0.0008098*LaktTag-0.00000096*LaktTag^2)))","v":0}]
[null,null,"Erhaltungsbedarf",{"$nulls":6},{"$f":"IF(Art=1,\"650 kg LG, BCS 3,5 -> 37,7 MJ NEL, 450 g nXP\",\"\")","v":"650 kg LG, BCS 3,5 -> 37,7 MJ NEL, 450 g nXP"},{"$nulls":13},{"$f":"ROUND(IF(LG=0,0,IF(Art=1,LG^0.75*0.293,IF(Art=2,LG^0.75*0.43,IF(Art=3,LG^0.75*0.43,\"\")))),1)","v":0},{"$f":"ROUND(IF(LG=0,0,IF(Art=1,190+LG*0.4,IF(Art=2,LG^0.75*3+15,IF(Art=3,LG^0.75*3.25,\"\")))),0)","v":0},null,"Laktation",{"$f":"IF(TMR=1,IF(LakNr=1,-0.658,0.236),IF(LakNr=1,-0.728,0.218))","v":0.218},"KF",{"$f":"IF(TMR=1,SUM(W29:W32,W37:W38)/TS*100*(0.0631-0.0002096*LaktTag+0.0000001213*LaktTag^2),SUM(W29:W32,W37:W38)*(0.6962-0.0023289*LaktTag+0.0000040634*LaktTag^2))","v":0}]
[{"$nulls":22},{"$f":"IF(OR(LakNr=\"\",LaktTag=\"\",LG=\"\",M_kg=\"\"),\"Daten?\",IF(Art=1,IF(M_kg=\"t\",4*NEL_kg-11,AB12+AB13+AB14+AB15+AD12+AD13+AD14+AD15),IF(Art=2,0.9+(LG*0.01)+(IF(M_kg=\"t\",0,M_kg-1)*0.4),IF(Art=3,0.9+(LG*0.01)+(IF(M_kg=\"t\",0,M_kg-1)*0.4),\"\"))))","v":"Daten?"},{"$f":"X13+X14","v":{"v":0,"d":"0.0"}},{"$f":"Y13+Y14","v":0},null,"LTag",{"$f":"IF(TMR=1,-5.445+5.298*(1-EXP(-0.01838*LaktTag)),-4.287+4.153*(1-EXP(-0.01486*LaktTag)))","v":-4.287},"GF_NEL",{"$f":"IF(TM_GF=0,\"\",IF(TMR=1,0.609*MJ_GF/TM_GF,0.858*MJ_GF/TM_GF))","v":""}]
[]
[null,null,"Futterart",{"$nulls":4},"Gehalt je kg TM im Futter",{"$nulls":13},"Gehalt der Ration",{"$nulls":13},"Kosten","Futter-bedarf"]
[null,{"$f":"IF(TM_FM=1,\"TM\",IF(TM_FM=2,\"FM\",\"\"))","v":"TM"},{"$nulls":4},"TS",{"$f":"IF($C$3=1,\"NEL\",\"ME\")","v":"NEL"},{"$f":"IF($C$3=1,\"nXP\",\"XP\")","v":"nXP"},{"$f":"IF($C$3=1,\"RNB\",\"\")","v":"RNB"},{"$f":"INDEX(Tabelle_Kopf,4,12)","v":"NFC"},{"$f":"IF(Art=1,\"SW\",\"\")","v":"SW"},{"$f":"INDEX(Tabelle_Kopf,4,10)","v":"ADF"},{"$f":"INDEX(Tabelle_Kopf,4,11)","v":"NDF"},{"$f":"INDEX(Tabelle_Kopf,4,13)","v":"XS"},{"$f":"INDEX(Tabelle_Kopf,4,14)","v":"XZ"},{"$f":"INDEX(Tabelle_Kopf,4,15)","v":"XL"},{"$f":"INDEX(Tabelle_Kopf,4,16)","v":"XF"},{"$f":"INDEX(Tabelle_Kopf,4,17)","v":"sXF"},{"$f":"INDEX(Tabelle_Kopf,4,25)","v":"DCAB"},"Kosten","FM","TM",{"$f":"+H18","v":"NEL"},{"$f":"+I18","v":"nXP"},{"$f":"+J18","v":"RNB"},{"$f":"+K18","v":"NFC"},{"$f":"+L18","v":"SW"},{"$f":"+M18","v":"ADF"},"NDF",{"$f":"+O18","v":"XS"},"XZ","XL","XF","sXF",null,"FM"]
[null,"kg",null,"Grobfutter",null,null,"%","MJ","g",{"$f":"IF(J18=\"\",\"\",\"g\")","v":"g"},"g",null,{"$f":"IF(M18=\"\",\"\",\"g\")","v":"g"},"g","g","g","g","g","g","meq","€/kg","kg","kg","MJ","g",{"$f":"J19","v":"g"},"g",null,"g","g","g","g","g","g","g","€","kg"]
[null,null,47,{"$f":"INDEX(Tabelle,$C20,1)","v":0},null,{"$f":"IF(INDEX(Tabelle,$C20,22)=\"\",\"\",1)","v":""},{"$f":"IF(INDEX(Tabelle,$C20,2)=\"\",\"\",INDEX(Tabelle,$C20,2)/10)","v":""},{"$f":"ROUND(IF(Art=1,INDEX(Tabelle,$C20,3),INDEX(Tabelle,$C20,4)),2)","v":{"v":0,"d":"0.0"}},{"$f":"ROUND(IF(Art=1,INDEX(Tabelle,$C20,7),INDEX(Tabelle,$C20,5)),2)","v":0},{"$f":"IF(Art=1,INDEX(Tabelle,$C20,8),0)","v":0},{"$f":"INDEX(Tabelle,$C20,12)","v":0},{"$f":"IF(Art=1,INDEX(Tabelle,$C20,9),0)","v":{"v":0,"d":"0.00"}},{"$f":"INDEX(Tabelle,$C20,10)","v":0},{"$f":"INDEX(Tabelle,$C20,11)","v":0},{"$f":"INDEX(Tabelle,$C20,13)","v":0},{"$f":"INDEX(Tabelle,$C20,14)","v":0},{"$f":"INDEX(Tabelle,$C20,15)","v":0},{"$f":"INDEX(Tabelle,$C20,16)","v":0},{"$f":"INDEX(Tabelle,$C20,17)*R20","v":0},{"$f":"INDEX(Tabelle,$C20,25)","v":0},{"$f":"INDEX(Tabelle,$C20,26)","v":0},{"$f":"IF(G20=\"\",0,IF(TM_FM=2,B20,B20/G20*100))","v":{"v":0,"d":"0.00"}},{"$f":"IF(G20=\"\",0,IF(TM_FM=1,B20,B20*G20/100))","v":{"v":0,"d":"0.00"}},{"$f":"W20*H20","v":{"v":0,"d":"0.0"}},{"$f":"W20*I20","v":0},{"$f":"W20*J20","v":{"v":0,"d":"0.0"}},{"$f":"+W20*K20","v":0},{"$f":"+W20*L20","v":{"v":0,"d":"0.0"}},{"$f":"IF(M20=\"-\",\"k.A.\",M20*$W20)","v":0},0,{"$f":"+W20*O20","v":0},{"$f":"+W20*P20","v":0},{"$f":"+W20*Q20","v":0},{"$f":"W20*R20","v":0},{"$f":"+S20*W20","v":0},{"$f":"IF(V20=0,0,V20*U20/100)","v":{"v":0,"d":"0.00"}},{"$f":"IF(Tiere>0,Tiere*V20,\"\")","v":""},{"$f":"IF(B20=\"\",\"\",IF(COUNTIF(G20:N20,0)>0,\"?\",\"\"))","v":""}]
[null,null,243,0,null,"","",{"v":0,"d":"0.0"},0,0,0,{"v":0,"d":"0.00"},0,0,0,0,0,0,0,0,0,{"v":0,"d":"0.00"},{"v":0,"d":"0.00"},{"v":0,"d":"0.0"},0,{"v":0,"d":"0.0"},0,{"v":0,"d":"0.0"},0,0,0,0,0,0,0,{"v":0,"d":"0.00"},"",""]
[null,null,47,0,null,"","",{"v":0,"d":"0.0"},0,0,0,{"v":0,"d":"0.00"},0,0,0,0,0,0,0,0,0,{"v":0,"d":"0.00"},{"v":0,"d":"0.00"},{"v":0,"d":"0.0"},0,{"v":0,"d":"0.0"},0,{"v":0,"d":"0.0"},0,0,0,0,0,0,0,{"v":0,"d":"0.00"},"",""]
[null,null,3,0,null,"","",{"v":0,"d":"0.0"},0,0,0,{"v":0,"d":"0.00"},0,0,0,0,0,0,0,0,0,{"v":0,"d":"0.00"},{"v":0,"d":"0.00"},{"v":0,"d":"0.0"},0,{"v":0,"d":"0.0"},0,{"v":0,"d":"0.0"},0,0,0,0,0,0,0,{"v":0,"d":"0.00"},"",""]
[null,null,3,0,null,"","",{"v":0,"d":"0.0"},0,0,0,{"v":0,"d":"0.00"},0,0,0,0,0,0,0,0,0,{"v":0,"d":"0.00"},{"v":0,"d":"0.00"},{"v":0,"d":"0.0"},0,{"v":0,"d":"0.0"},0,{"v":0,"d":"0.0"},0,0,0,0,0,0,0,{"v":0,"d":"0.00"},"",""]
[null,null,3,0,null,"","",{"v":0,"d":"0.0"},0,0,0,{"v":0,"d":"0.00"},0,0,0,0,0,0,0,0,0,{"v":0,"d":"0.00"},{"v":0,"d":"0.00"},{"v":0,"d":"0.0"},0,{"v":0,"d":"0.0"},0,{"v":0,"d":"0.0"},0,0,0,0,0,0,0,{"v":0,"d":"0.00"},"",""]
[{"$nulls":13},"Summe",{"$nulls":7},{"$f":"SUM(V20:V25)","v":{"v":0,"d":"0.00"}},{"v":0,"d":"0.00"},{"v":0,"d":"0.0"},0,{"v":0,"d":"0.0"},0,0,0,0,0,0,0,0,0,{"$f":"SUM(AJ20:AJ25)","v":{"v":0,"d":"0.00"}},0]
[{"$nulls":3},"Rationsausgleich/Mineralfutter",{"$nulls":17},"je kg TM",{"$f":"IF(W26=0,\"\",TM_GF/V26)","v":""},{"$f":"IF($W$26>0,X26/TM_GF,\"\")","v":""},"","","","","",""]
[]
[null,null,3,{"$f":"INDEX(Tabelle,$C29,1)","v":0},null,{"$f":"IF(INDEX(Tabelle,$C29,22)=\"\",\"\",1)","v":""},{"$f":"IF(INDEX(Tabelle,$C29,2)=\"\",\"\",INDEX(Tabelle,$C29,2)/10)","v":""},{"$f":"ROUND(IF(Art=1,INDEX(Tabelle,$C29,3),INDEX(Tabelle,$C29,4)),2)","v":{"v":0,"d":"0.0"}},{"$f":"ROUND(IF(Art=1,INDEX(Tabelle,$C29,7),INDEX(Tabelle,$C29,6)),2)","v":0},{"$f":"IF(Art=1,INDEX(Tabelle,$C29,8),0)","v":0},{"$f":"INDEX(Tabelle,$C29,12)","v":0},{"$f":"IF(Art=1,INDEX(Tabelle,$C29,9),0)","v":{"v":0,"d":"0.00"}},{"$f":"INDEX(Tabelle,$C29,10)","v":0},{"$f":"INDEX(Tabelle,$C29,11)","v":0},{"$f":"INDEX(Tabelle,$C29,13)","v":0},{"$f":"INDEX(Tabelle,$C29,14)","v":0},{"$f":"INDEX(Tabelle,$C29,15)","v":0},{"$f":"INDEX(Tabelle,$C29,16)","v":0},{"$f":"INDEX(Tabelle,$C29,17)*R29","v":0},{"$f":"INDEX(Tabelle,$C29,25)","v":0},{"$f":"INDEX(Tabelle,$C29,26)","v":0},{"$f":"IF(G29=\"\",0,IF(TM_FM=2,B29,B29/G29*100))","v":{"v":0,"d":"0.00"}},{"$f":"IF(G29=\"\",0,IF(TM_FM=1,B29,B29*G29/100))","v":{"v":0,"d":"0.00"}},{"$f":"W29*H29","v":{"v":0,"d":"0.0"}},{"$f":"W29*I29","v":0},{"$f":"W29*J29","v":{"v":0,"d":"0.0"}},{"$f":"+W29*K29","v":0},{"$f":"+W29*L29","v":{"v":0,"d":"0.0"}},{"$f":"IF(M29=\"-\",\"k.A.\",M29*$W29)","v":0},0,{"$f":"+W29*O29","v":0},{"$f":"+W29*P29","v":0},{"$f":"+W29*Q29","v":0},{"$f":"W29*R29","v":0},{"$f":"+S29*W29","v":0},{"$f":"IF(V29=0,0,V29*U29/100)","v":{"v":0,"d":"0.00"}},{"$f":"IF(Tiere>0,Tiere*V29,\"\")","v":""},{"$f":"IF(B29=\"\",\"\",IF(COUNTIF(G29:N29,0)>0,\"?\",\"\"))","v":""}]
[null,null,3,{"$f":"INDEX(Tabelle,$C30,1)","v":0},null,{"$f":"IF(INDEX(Tabelle,$C30,22)=\"\",\"\",1)","v":""},{"$f":"IF(INDEX(Tabelle,$C30,2)=\"\",\"\",INDEX(Tabelle,$C30,2)/10)","v":""},{"$f":"ROUND(IF(Art=1,INDEX(Tabelle,$C30,3),INDEX(Tabelle,$C30,4)),2)","v":{"v":0,"d":"0.0"}},{"$f":"ROUND(IF(Art=1,INDEX(Tabelle,$C30,7),INDEX(Tabelle,$C30,6)),2)","v":0},{"$f":"IF(Art=1,INDEX(Tabelle,$C30,8),0)","v":0},{"$f":"INDEX(Tabelle,$C30,12)","v":0},{"$f":"IF(Art=1,INDEX(Tabelle,$C30,9),0)","v":{"v":0,"d":"0.00"}},{"$f":"INDEX(Tabelle,$C30,10)","v":0},{"$f":"INDEX(Tabelle,$C30,11)","v":0},{"$f":"INDEX(Tabelle,$C30,13)","v":0},{"$f":"INDEX(Tabelle,$C30,14)","v":0},{"$f":"INDEX(Tabelle,$C30,15)","v":0},{"$f":"INDEX(Tabelle,$C30,16)","v":0},{"$f":"INDEX(Tabelle,$C30,17)*R30","v":0},{"$f":"INDEX(Tabelle,$C30,25)","v":0},{"$f":"INDEX(Tabelle,$C30,26)","v":0},{"$f":"IF(G30=\"\",0,IF(TM_FM=2,B30,B30/G30*100))","v":{"v":0,"d":"0.00"}},{"$f":"IF(G30=\"\",0,IF(TM_FM=1,B30,B30*G30/100))","v":{"v":0,"d":"0.00"}},{"$f":"W30*H30","v":{"v":0,"d":"0.0"}},{"$f":"W30*I30","v":0},{"$f":"W30*J30","v":{"v":0,"d":"0.0"}},{"$f":"+W30*K30","v":0},{"$f":"+W30*L30","v":{"v":0,"d":"0.0"}},0,0,{"$f":"+W30*O30","v":0},{"$f":"+W30*P30","v":0},{"$f":"+W30*Q30","v":0},{"$f":"W30*R30","v":0},{"$f":"+S30*W30","v":0},{"v":0,"d":"0.00"},{"$f":"IF(Tiere>0,Tiere*V30,\"\")","v":""},{"$f":"IF(B30=\"\",\"\",IF(COUNTIF(G30:N30,0)>0,\"?\",\"\"))","v":""}]
[null,null,3,{"$f":"INDEX(Tabelle,$C31,1)","v":0},null,{"$f":"IF(INDEX(Tabelle,$C31,22)=\"\",\"\",1)","v":""},{"$f":"IF(INDEX(Tabelle,$C31,2)=\"\",\"\",INDEX(Tabelle,$C31,2)/10)","v":""},{"$f":"ROUND(IF(Art=1,INDEX(Tabelle,$C31,3),INDEX(Tabelle,$C31,4)),2)","v":{"v":0,"d":"0.0"}},{"$f":"ROUND(IF(Art=1,INDEX(Tabelle,$C31,7),INDEX(Tabelle,$C31,6)),2)","v":0},{"$f":"IF(Art=1,INDEX(Tabelle,$C31,8),0)","v":0},{"$f":"INDEX(Tabelle,$C31,12)","v":0},{"$f":"IF(Art=1,INDEX(Tabelle,$C31,9),0)","v":{"v":0,"d":"0.00"}},{"$f":"INDEX(Tabelle,$C31,10)","v":0},{"$f":"INDEX(Tabelle,$C31,11)","v":0},{"$f":"INDEX(Tabelle,$C31,13)","v":0},{"$f":"INDEX(Tabelle,$C31,14)","v":0},{"$f":"INDEX(Tabelle,$C31,15)","v":0},{"$f":"INDEX(Tabelle,$C31,16)","v":0},{"$f":"INDEX(Tabelle,$C31,17)*R31","v":0},{"$f":"INDEX(Tabelle,$C31,25)","v":0},{"$f":"INDEX(Tabelle,$C31,26)","v":0},{"$f":"IF(G31=\"\",0,IF(TM_FM=2,B31,B31/G31*100))","v":{"v":0,"d":"0.00"}},{"$f":"IF(G31=\"\",0,IF(TM_FM=1,B31,B31*G31/100))","v":{"v":0,"d":"0.00"}},{"$f":"W31*H31","v":{"v":0,"d":"0.0"}},{"$f":"W31*I31","v":0},{"$f":"W31*J31","v":{"v":0,"d":"0.0"}},{"$f":"+W31*K31","v":0},{"$f":"+W31*L31","v":{"v":0,"d":"0.0"}},0,0,{"$f":"+W31*O31","v":0},{"$f":"+W31*P31","v":0},{"$f":"+W31*Q31","v":0},{"$f":"W31*R31","v":0},{"$f":"+S31*W31","v":0},{"v":0,"d":"0.00"},{"$f":"IF(Tiere>0,Tiere*V31,\"\")","v":""},{"$f":"IF(B31=\"\",\"\",IF(COUNTIF(G31:N31,0)>0,\"?\",\"\"))","v":""}]
[null,null,3,{"$f":"INDEX(Tabelle,$C32,1)","v":0},null,{"$f":"IF(INDEX(Tabelle,$C32,22)=\"\",\"\",1)","v":""},{"$f":"IF(INDEX(Tabelle,$C32,2)=\"\",\"\",INDEX(Tabelle,$C32,2)/10)","v":""},{"$f":"ROUND(IF(Art=1,INDEX(Tabelle,$C32,3),INDEX(Tabelle,$C32,4)),2)","v":{"v":0,"d":"0.0"}},{"$f":"ROUND(IF(Art=1,INDEX(Tabelle,$C32,7),INDEX(Tabelle,$C32,6)),2)","v":0},{"$f":"IF(Art=1,INDEX(Tabelle,$C32,8),0)","v":0},{"$f":"INDEX(Tabelle,$C32,12)","v":0},{"$f":"IF(Art=1,INDEX(Tabelle,$C32,9),0)","v":{"v":0,"d":"0.00"}},{"$f":"INDEX(Tabelle,$C32,10)","v":0},{"$f":"INDEX(Tabelle,$C32,11)","v":0},{"$f":"INDEX(Tabelle,$C32,13)","v":0},{"$f":"INDEX(Tabelle,$C32,14)","v":0},{"$f":"INDEX(Tabelle,$C32,15)","v":0},{"$f":"INDEX(Tabelle,$C32,16)","v":0},{"$f":"INDEX(Tabelle,$C32,17)*R32","v":0},{"$f":"INDEX(Tabelle,$C32,25)","v":0},{"$f":"INDEX(Tabelle,$C32,26)","v":0},{"$f":"IF(G32=\"\",0,IF(TM_FM=2,B32,B32/G32*100))","v":{"v":0,"d":"0.00"}},{"$f":"IF(G32=\"\",0,IF(TM_FM=1,B32,B32*G32/100))","v":{"v":0,"d":"0.00"}},{"$f":"W32*H32","v":{"v":0,"d":"0.0"}},{"$f":"W32*I32","v":0},{"$f":"W32*J32","v":{"v":0,"d":"0.0"}},{"$f":"+W32*K32","v":0},{"$f":"+W32*L32","v":{"v":0,"d":"0.0"}},0,0,{"$f":"+W32*O32","v":0},{"$f":"+W32*P32","v":0},{"$f":"+W32*Q32","v":0},{"$f":"W32*R32","v":0},{"$f":"+S32*W32","v":0},{"v":0,"d":"0.00"},{"$f":"IF(Tiere>0,Tiere*V32,\"\")","v":""},{"$f":"IF(B32=\"\",\"\",IF(COUNTIF(G32:N32,0)>0,\"?\",\"\"))","v":""}]
[{"$nulls":13},"Summe",{"$nulls":7},{"$f":"SUM(V29:V32,V20:V25)","v":{"v":0,"d":"0.00"}},{"$f":"SUM(W29:W32,W20:W25)","v":{"v":0,"d":"0.00"}},{"v":0,"d":"0.0"},0,{"v":0,"d":"0.0"},0,0,0,0,{"$f":"SUM(AE29:AE32,AE20:AE25)","v":0},0,0,0,0,{"v":0,"d":"0.00"},0]
[{"$nulls":21},"je kg TM",{"$f":"IF(W33=0,\"\",TM_Grundration/V33)","v":""},{"$f":"IF($W$33>0,X33/$W$33,\"\")","v":""},{"$f":"IF($W$33>0,Y33/$W$33,\"\")","v":""},"","","","","",{"$f":"IF($W$33>0,AE33/$W$33,\"\")","v":""},"","","",""]
[{"$nulls":3},"Milchleistungsfutter (Abruffütterung!)",{"$nulls":19},{"$f":"IF(X12=0,0,(X33-X14)/X12)","v":{"v":0,"d":"0.0"}},{"$f":"IF(Y12=0,0,(Y33-Y14)/Y12)","v":{"v":0,"d":"0.0"}},"kg Milch",{"$f":"+IF(X33=0,\"\",AA33/$V33*0.001)","v":""},{"$f":"IF(V33=0,\"\",SUM(AB27:AB32)/V33)","v":""},{"$f":"IF(OR(AC33=\"k.A.\",V33=0),\"\",+AC33/$V33*0.001)","v":""},{"$f":"IF(OR(AD33=\"k.A.\",V33=0),\"\",+AD33/$V33*0.001)","v":""},null,{"$f":"+IF(V33=0,\"\",AF34/$V33*0.001)","v":""},{"$f":"+IF(Y33=0,\"\",AG34/$V33*0.001)","v":""},{"$f":"+IF(Y33=0,\"\",AH34/$V33*0.001)","v":""},{"$f":"+IF(Z33=0,\"\",AI34/$V33*0.001)","v":""}]
[]
[null,null,3,{"$f":"INDEX(Tabelle,$C37,1)","v":0},null,{"$f":"IF(INDEX(Tabelle,$C37,22)=\"\",\"\",1)","v":""},{"$f":"IF(INDEX(Tabelle,$C37,2)=\"\",\"\",INDEX(Tabelle,$C37,2)/10)","v":""},{"$f":"ROUND(IF(Art=1,INDEX(Tabelle,$C37,3),INDEX(Tabelle,$C37,4)),2)","v":{"v":0,"d":"0.0"}},{"$f":"ROUND(IF(Art=1,INDEX(Tabelle,$C37,7),INDEX(Tabelle,$C37,6)),2)","v":0},{"$f":"IF(Art=1,INDEX(Tabelle,$C37,8),0)","v":0},{"$f":"INDEX(Tabelle,$C37,12)","v":0},{"$f":"IF(Art=1,INDEX(Tabelle,$C37,9),0)","v":{"v":0,"d":"0.00"}},{"$f":"INDEX(Tabelle,$C37,10)","v":0},{"$f":"INDEX(Tabelle,$C37,11)","v":0},{"$f":"INDEX(Tabelle,$C37,13)","v":0},{"$f":"INDEX(Tabelle,$C37,14)","v":0},{"$f":"INDEX(Tabelle,$C37,15)","v":0},{"$f":"INDEX(Tabelle,$C37,16)","v":0},{"$f":"INDEX(Tabelle,$C37,17)*R37","v":0},{"$f":"INDEX(Tabelle,$C37,25)","v":0},{"$f":"INDEX(Tabelle,$C37,26)","v":0},{"$f":"IF(G37=\"\",0,IF(TM_FM=2,B37,B37/G37*100))","v":{"v":0,"d":"0.00"}},{"$f":"IF(G37=\"\",0,IF(TM_FM=1,B37,B37*G37/100))","v":{"v":0,"d":"0.00"}},{"$f":"W37*H37","v":{"v":0,"d":"0.0"}},{"$f":"W37*I37","v":0},{"$f":"W37*J37","v":{"v":0,"d":"0.0"}},{"$f":"+W37*K37","v":0},{"$f":"+W37*L37","v":{"v":0,"d":"0.0"}},{"$f":"IF(M37=\"-\",\"k.A.\",M37*$W37)","v":0},{"$f":"IF(N37=\"-\",\"k.A.\",N37*$W37)","v":0},{"$f":"+W37*O37","v":0},{"$f":"+W37*P37","v":0},{"$f":"+W37*Q37","v":0},{"$f":"W37*R37","v":0},{"$f":"+S37*W37","v":0},{"$f":"IF(V37=0,0,V37*U37/100)","v":{"v":0,"d":"0.00"}},{"$f":"IF(Tiere>0,Tiere*V37,\"\")","v":""},{"$f":"IF(B37=\"\",\"\",IF(COUNTIF(G37:N37,0)>0,\"?\",\"\"))","v":""}]
[null,null,3,{"$f":"INDEX(Tabelle,$C38,1)","v":0},null,{"$f":"IF(INDEX(Tabelle,$C38,22)=\"\",\"\",1)","v":""},{"$f":"IF(INDEX(Tabelle,$C38,2)=\"\",\"\",INDEX(Tabelle,$C38,2)/10)","v":""},{"$f":"ROUND(IF(Art=1,INDEX(Tabelle,$C38,3),INDEX(Tabelle,$C38,4)),2)","v":{"v":0,"d":"0.0"}},{"$f":"ROUND(IF(Art=1,INDEX(Tabelle,$C38,7),INDEX(Tabelle,$C38,6)),2)","v":0},{"$f":"IF(Art=1,INDEX(Tabelle,$C38,8),0)","v":0},{"$f":"INDEX(Tabelle,$C38,12)","v":0},{"$f":"IF(Art=1,INDEX(Tabelle,$C38,9),0)","v":{"v":0,"d":"0.00"}},{"$f":"INDEX(Tabelle,$C38,10)","v":0},{"$f":"INDEX(Tabelle,$C38,11)","v":0},{"$f":"INDEX(Tabelle,$C38,13)","v":0},{"$f":"INDEX(Tabelle,$C38,14)","v":0},{"$f":"INDEX(Tabelle,$C38,15)","v":0},{"$f":"INDEX(Tabelle,$C38,16)","v":0},{"$f":"INDEX(Tabelle,$C38,17)*R38","v":0},{"$f":"INDEX(Tabelle,$C38,25)","v":0},{"$f":"INDEX(Tabelle,$C38,26)","v":0},{"$f":"IF(G38=\"\",0,IF(TM_FM=2,B38,B38/G38*100))","v":{"v":0,"d":"0.00"}},{"$f":"IF(G38=\"\",0,IF(TM_FM=1,B38,B38*G38/100))","v":{"v":0,"d":"0.00"}},{"$f":"W38*H38","v":{"v":0,"d":"0.0"}},{"$f":"W38*I38","v":0},{"$f":"W38*J38","v":{"v":0,"d":"0.0"}},{"$f":"+W38*K38","v":0},{"$f":"+W38*L38","v":{"v":0,"d":"0.0"}},{"$f":"IF(M38=\"-\",\"k.A.\",M38*$W38)","v":0},{"$f":"IF(N38=\"-\",\"k.A.\",N38*$W38)","v":0},{"$f":"+W38*O38","v":0},{"$f":"+W38*P38","v":0},{"$f":"+W38*Q38","v":0},{"$f":"W38*R38","v":0},{"$f":"+S38*W38","v":0},{"$f":"IF(V38=0,0,V38*U38/100)","v":{"v":0,"d":"0.00"}},{"$f":"IF(Tiere>0,Tiere*V38,\"\")","v":""},{"$f":"IF(B38=\"\",\"\",IF(COUNTIF(G38:N38,0)>0,\"?\",\"\"))","v":""}]
[null,{"$f":"B18&\", \"&B19","v":"TM, kg"},{"$nulls":16},{"$f":"IF(OR(LakNr=0,LaktTag=0,LG=0,M_kg=0,TS=0),0,(2.274-0.898+IF(LakNr=1,-0.658,0)+(-5.445+5.298*(1-EXP(-0.0184*LaktTag)))+(LG*(0.0173-0.0000514*LaktTag+0.0000000999*LaktTag^2))+ (IF(M_kg=\"t\",0,M_kg*(0.201+0.000808*LaktTag-0.000001299*LaktTag^2)))+(((TS-TM_GF)/TS*100)*0.0631-0.0002096*LaktTag+0.0000001213*LaktTag^2)+(0.609*MJ_GF/TM_GF))*0.92+0.71)","v":0},null,null,"FM kg","TM kg",{"$f":"+X10&\"          \"&X11","v":"NEL          MJ"},{"$f":"+Y10&\"            \"&Y11","v":"nXP            g"},{"$f":"\" \"&Z10&\"            \"&Z11","v":" RNB            -20 bis \n+50 g"},{"$f":"+AA10&\"             \"&AA11","v":"NFC             <400g/kg"},{"$f":"+AB10&\"          \"&AB11","v":"SW          >1,2"},{"$f":"+AC10&\"          \"&AC11","v":"ADF          >200"},{"$f":"+AD10&\"          \"&AD11","v":"NDF          >300"},{"$f":"+AE10&\"          \"&AE11","v":"XS          <350"},{"$f":"+AF10&\"          \"&AF11","v":"XZ          <350"},{"$f":"+AG10&\"                        \"&AG11","v":"XL                        <40"},{"$f":"+AH10&\"          \"&AH11","v":"XF          >160"},{"$f":"+AI10&\"          \"&AI11","v":"sXF          >100"},null,"Gesamt-menge \nkg FM"]
[null,{"$f":"SUM(B20:B25,B29:B32,B37:B38)","v":{"v":0,"d":"0.00"}},{"$nulls":11},"Summe",{"$nulls":7},{"$f":"V33+V37+V38","v":{"v":0,"d":"0.0"}},{"v":0,"d":"0.0"},{"v":0,"d":"0.0"},0,{"v":0,"d":"0.0"},0,{"v":0,"d":"0.0"},{"$f":"IF( OR(,AC33=\"k.A.\",AC37=\"k.A.\",AC38=\"k.A.\"),\"k.A.\",SUM(AC33,AC37:AC38))","v":0},0,0,0,0,0,0,{"v":0,"d":"0.00"},{"$f":"SUM(AK37:AK38,AK33)","v":0}]
[{"$nulls":17},"TMR HF",{"$f":"IF(OR(LakNr=0,LaktTag=0,LG=0,M_kg=0,TS=0),0,(2.274-1.391+IF(LakNr=1,-0.658,0)+(-5.445+5.298*(1-EXP(-0.0184*LaktTag)))+(LG*(0.0173-0.0000514*LaktTag+0.0000000999*LaktTag^2))+ (IF(M_kg=\"t\",0,M_kg*(0.201+0.000808*LaktTag-0.000001299*LaktTag^2)))+(((TS-TM_GF)/TS*100)*0.0631-0.0002096*LaktTag+0.0000001213*LaktTag^2)+(0.609*MJ_GF/TM_GF))*0.92+0.71)","v":0},null,null,"je kg TM",{"$f":"IF(W40=0,\"\",TS/V40)","v":""},{"$f":"IF($W$40>0,X40/$W$40,\"\")","v":""},"","","","","","","","","","",""]
[{"$nulls":17},"TMR HF",{"$f":"IF(OR(LakNr=0,LaktTag=0,LG=0,M_kg=0,TS=0),0,(2.274-1.391+IF(LakNr=1,-0.658,0)+(-5.445+5.298*(1-EXP(-0.0184*LaktTag)))+(LG*(0.0173-0.0000514*LaktTag+0.0000000999*LaktTag^2))+ (IF(M_kg=\"t\",0,M_kg*(0.201+0.000808*LaktTag-0.000001299*LaktTag^2)))+(((TS-TM_GF)/TS*100)*0.0631-0.0002096*LaktTag+0.0000001213*LaktTag^2)+(0.609*MJ_GF/TM_GF))*0.92+0.71)","v":0},null,null,"Abw. V. Ziel",{"$f":"IF(TS=0,\"\",IF(W40<ITmin*W15,ROUND((W40-W15)/W15,0),IF(W40<ITmin*1.05*W15,\"!\",IF(W40>ITmax*W15,\"+\"&ROUND((W40-W15)/W15*100,0)&\"%\",IF(W40>ITmax*0.95*W15,\"!\",\"\")))))","v":""},{"$f":"IF(X40<NELmin*X15,ROUND((X40-X15)/X15,0),IF(X40<NELmin*1.05*X15,\"!\",IF(X40>NELmax*X15,\"+\"&ROUND((X40-X15)/X15*100,0)&\"%\",IF(X40>NELmax*0.95*X15,\"!\",\"\"))))","v":""},{"$f":"IF(Y40<nXPmin*Y15,ROUND((Y40-Y15)/Y15,0),IF(Y40<nXPmin*1.05*Y15,\"!\",IF(Y40>nXPmax*Y15,\"+\"&ROUND((Y40-Y15)/Y15*100,0)&\"%\",IF(Y40>nXPmax*0.95*Y15,\"!\",\"\"))))","v":""},{"$f":"IF(M_kg=\"T\",IF(Z40>RNB_t_max+10,Z40-RNB_t_max,IF(Z40<RNB_t_min-10,IF(Z40<RNB_t_min-10,Z40-RNB_t_min),IF(OR(Z40<RNB_t_min,Z40>RNB_t_max),\"!\",\"\"))),IF(Z40<RNBmin-5,Z40-RNBmin,IF(Z40>RNBmax+15,Z40-RNBmax,IF(OR(Z40<RNBmin,Z40>RNBmax),\"!\",\"\"))))","v":""},{"$f":"IF(W40=0,\"\",IF(AA41>NFCmax,\"+\"&ROUND((AA41-NFCmax)/NFCmax*100,0)&\"%\",IF(AA41>NFCmax*0.95,\"!\",\"\")))","v":""},{"$f":"IF(AB41<SWmin,ROUND((AB41-SWmin)/SWmin*100&\"%\",0),IF(AB41<SWmin*1.05,\"!\",\"\"))","v":""},{"$f":"IF(AC41<ADFmin,ROUND((AC41-ADFmin)/ADFmin*100,0)&\"%\",IF(AC41<ADFmin*1.05,\"!\",\"\"))","v":""},{"$f":"IF(AD41<NDFmin,ROUND((AD41-NDFmin)/NDFmin*100,0)&\"%\",IF(AD41<NDFmin*1.05,\"!\",\"\"))","v":""},{"$f":"IF(AE41>XSmax,\"+\"&ROUND((AE41-XSmax)/XSmax*100,0)&\"%\",IF(AE41>XSmax*0.95,\"!\",\"\"))","v":{"$error":"#VALUE!"}},{"$f":"IF(AF41>XZmax,\"+\"&ROUND((AF41-XZmax)/XZmax*100,0)&\"%\",IF(AF41>XZmax*0.95,\"!\",\"\"))","v":{"$error":"#VALUE!"}},{"$f":"IF(AG41>XLmax,\"+\"&ROUND((AG41-XLmax)/XLmax*100,0)&\"%\",IF(AG41>XLmax*0.95,\"!\",\"\"))","v":{"$error":"#VALUE!"}},{"$f":"IF(AH41<XFmin,ROUND((AH41-XFmin)/XFmin*100,0)&\"%\",IF(AH41<XFmin*1.05,\"!\",\"\"))","v":""},{"$f":"IF(AI41<sXFmin,ROUND((AI41-sXFmin)/sXFmin*100,0)&\"%\",IF(AI41<sXFmin*1.05,\"!\",\"\"))","v":""}]
[{"$nulls":17},"Einzel HF",{"$f":"IF(OR(LakNr=0,LaktTag=0,LG=0,M_kg=0,TS=0),0,(3.878-1.826+IF(LakNr=1,-0.728,0)+(-4.287+4.153*(1-EXP(-0.01486*LaktTag)))+(LG*(0.0148-0.0000474*LaktTag+0.0000000904*LaktTag^2))+(IF(M_kg=\"t\",0,M_kg*(0.0825+0.0008098*LaktTag-0.000000966*LaktTag^2)))+((TS-TM_GF)*(0.6962-0.0023289*LaktTag+0.0000040634*LaktTag^2))+(0.858*MJ_GF/TM_GF))*0.93+0.47)","v":0},{"$nulls":3},{"$f":"IF(W15=\"Daten?\",\"\",IF(OR(W40>1.1*W15,W40<0.9*W15),\"Die TM-Aufnahme sollte überprüft werden!\",\"Soll \"&ROUND(W15,1)))","v":""},{"$f":"IF(X12=0,0,(X40-X14)/X12)","v":{"v":0,"d":"0.0"}},{"$f":"IF(Y12=0,0,(Y40-Y14)/Y12)","v":{"v":0,"d":"0.0"}},"kg Milch",{"$f":"+AB41","v":""},null,{"$f":"IF(OR(AD40=\"k.A.\",V40=0),\"\",+AD40/$V40*0.001)","v":""},{"$f":"IF(X40=0,\"\",+AA40/$V40*0.001)","v":""},null,{"$f":"IF(V40=0,\"\",+AF40/$V40*0.001)","v":""},null,{"$f":"IF(Y40=0,\"\",+AH40/$V40*0.001)","v":""},{"$f":"IF(Z40=0,\"\",+AI40/$V40*0.001)","v":""}]
[]
[{"$nulls":21},"Mineralstoffbilanzierung",null,{"$f":"'Ration Milch-Mineralstoffe'!N14","v":"Ca"},{"$f":"'Ration Milch-Mineralstoffe'!O14","v":"P"},{"$f":"'Ration Milch-Mineralstoffe'!P14","v":"Na"},{"$f":"'Ration Milch-Mineralstoffe'!Q14","v":"Mg"},{"$f":"'Ration Milch-Mineralstoffe'!R14","v":"K"},{"$f":"'Ration Milch-Mineralstoffe'!S14","v":"Se"},{"$f":"'Ration Milch-Mineralstoffe'!T14","v":"DCAB"},"Ca:P","Na:K",{"$nulls":4},"Kosten"]
[{"$nulls":22},"Bedarf",{"$f":"'Ration Milch-Mineralstoffe'!N11/'Ration Milch-Mineralstoffe'!M7","v":{"$error":"#DIV/0!"}},{"$f":"'Ration Milch-Mineralstoffe'!O11/'Ration Milch-Mineralstoffe'!M7","v":{"$error":"#DIV/0!"}},{"$f":"'Ration Milch-Mineralstoffe'!P11/'Ration Milch-Mineralstoffe'!M7","v":{"$error":"#DIV/0!"}},{"$f":"'Ration Milch-Mineralstoffe'!Q11/'Ration Milch-Mineralstoffe'!M7","v":{"$error":"#DIV/0!"}},{"$f":"'Ration Milch-Mineralstoffe'!R11/'Ration Milch-Mineralstoffe'!M7","v":{"$error":"#DIV/0!"}},{"$f":"'Ration Milch-Mineralstoffe'!S11/'Ration Milch-Mineralstoffe'!M7","v":{"$error":"#DIV/0!"}},{"$f":"'Ration Milch-Mineralstoffe'!T11&\"                   meq/kg TM\"","v":"200-350                   meq/kg TM"},{"$f":"\"1 : \"&FIXED((CaPmin+CaPmax)/2,2)","v":"1 : 0,63"},{"$f":"\"1 : \"&FIXED((NaKmin+NaKmax)/2,1)","v":"1 : 10,0"},{"$nulls":4},"ct/kg MEW"]
[{"$nulls":22},"IST",{"$f":"'Ration Milch-Mineralstoffe'!N38","v":""},{"$f":"'Ration Milch-Mineralstoffe'!O38","v":""},{"$f":"'Ration Milch-Mineralstoffe'!P38","v":""},{"$f":"'Ration Milch-Mineralstoffe'!Q38","v":""},{"$f":"'Ration Milch-Mineralstoffe'!R38","v":""},{"$f":"IF('Ration Milch-Mineralstoffe'!S38=0,\"k.A.\",'Ration Milch-Mineralstoffe'!S38)","v":""},{"$f":"'Ration Milch-Mineralstoffe'!T38","v":""},{"$f":"\"1 : \"&FIXED('Ration Milch-Mineralstoffe'!O38/'Ration Milch-Mineralstoffe'!N38,2)","v":{"$error":"#VALUE!"}},{"$f":"\"1 : \"&FIXED('Ration Milch-Mineralstoffe'!R38/'Ration Milch-Mineralstoffe'!P38,1)","v":{"$error":"#VALUE!"}},{"$nulls":4},{"$f":"IF(X43<>0,AJ40/X43*100,\"\")","v":""}]
[{"$nulls":23},{"$f":"IF(X47<Camin*X46,ROUND((X47/X46-1),2),IF(X47<Camin*1.05*X46,\"!\",IF(X47>Camax*X46,\"+\"&ROUND((X47/X46-1)*100,0)&\"%\",IF(X47>Camax*0.95*X46,\"!\",\"\"))))","v":{"$error":"#DIV/0!"}},{"$f":"IF(Y47<Pmin*Y46,ROUND((Y47/Y46-1),2),IF(Y47<Pmin*1.05*Y46,\"!\",IF(Y47>Pmax*Y46,\"+\"&ROUND((Y47/Y46-1)*100,0)&\"%\",IF(Y47>Pmax*0.95*Y46,\"!\",\"\"))))","v":{"$error":"#DIV/0!"}},{"$f":"IF(Z47<Namin*Z46,ROUND((Z47/Z46-1),2),IF(Z47<Namin*1.05*Z46,\"!\",IF(Z47>Namax*Z46,\"+\"&ROUND((Z47/Z46-1)*100,0)&\"%\",IF(Z47>Namax*0.95*Z46,\"!\",\"\"))))","v":{"$error":"#DIV/0!"}},{"$f":"IF(AA47<Mgmin*AA46,ROUND((AA47/AA46-1),2),IF(AA47<Mgmin*1.05*AA46,\"!\",IF(AA47>Mgmax*AA46,\"+\"&ROUND((AA47/AA46-1)*100,0)&\"%\",IF(AA47>Mgmax*0.95*AA46,\"!\",\"\"))))","v":{"$error":"#DIV/0!"}},{"$f":"IF(AB47<Kmin*AB46,ROUND((AB47/AB46-1),2),IF(AB47<Kmin*1.05*AB46,\"!\",IF(AB47>Kmax*AB46,\"+\"&ROUND((AB47/AB46-1)*100,0)&\"%\",IF(AB47>Kmax*0.95*AB46,\"!\",\"\"))))","v":{"$error":"#DIV/0!"}},{"$f":"IF(AC47=\"k.A.\",\"k.A.\",IF(AC47<Semin*AC46,ROUND((AC47-AC46)/AC46,0),IF(AC47<Semin*1.05*AC46,\"!\",IF(AC47>Semax*AC46,\"+\"&ROUND((AC47-AC46)/AC46*100,0)&\"%\",IF(AC47>Semax*0.95*AC46,\"!\",\"\")))))","v":{"$error":"#DIV/0!"}},{"$f":"IF(M_kg=\"T\",IF(AD47>DCAB_t_max+100,AD47-100,IF(AD47>DCAB_t_max,\"!\",\"\")),IF(AD47<DCAB_lakt_min-50,AD47-DCAB_lakt_min,IF(AD47>DCAB_lakt_max+50,AD47-DCAB_lakt_max,IF(OR(AD47<DCAB_lakt_min,AD47>DCAB_lakt_max),\"!\",\"\"))))","v":{"$error":"#VALUE!"}},{"$f":"IF(RIGHT(AE47,4)*1<CaPmin,RIGHT(AE47,4)/RIGHT(AE46,4)-1,IF(RIGHT(AE47,4)*1<CaPmin*1.1,\"!\",IF(RIGHT(AE47,4)*1>CaPmax,\"+\"&ROUND((RIGHT(AE47,4)/RIGHT(AE46,4)-1)*100,2)&\"%\",IF(RIGHT(AE47,4)*1>CaPmax*0.9,\"!\",\"\"))))","v":{"$error":"#VALUE!"}},{"$f":"IF(RIGHT(AF47,4)*1<NaKmin,RIGHT(AF47,4)/RIGHT(AF46,4)-1,IF(RIGHT(AF47,4)*1<NaKmin*1.1,\"!\",IF(RIGHT(AF47,4)*1>NaKmax,\"+\"&ROUND((RIGHT(AF47,4)/RIGHT(AF46,4)-1)*100,2)&\"%\",IF(RIGHT(AF47,4)*1>NaKmax*0.9,\"!\",\"\"))))","v":{"$error":"#VALUE!"}},{"$nulls":4},{"$f":"IF(COUNTIF(AJ20:AJ38,\">0\")<>COUNTIF(AK20:AK38,\">0\"),\"!\",\"\")","v":""}]
[]
[null,{"$f":"' '!B4&\", © W. Sekul, LAZBW Aulendorf\"","v":"UniRat 2022, © W. Sekul, LAZBW Aulendorf"},{"$nulls":26},{"$f":"Einstellungen!C1","v":"Bearbeiter*in:"},{"$f":"Einstellungen!E1","v":"E. Gerster"}]

{"sheet":"Ration Milch-Mineralstoffe","index":5,"n_rows":42,"n_cols":21,"rows_kept":42}
["Mineralstoffbilanzierung"]
[]
[{"$nulls":3},"Laktationen",{"$f":"'Ration Milch'!H8","v":"Laktations-tag"},"Gewicht","Milchleistung"]
[{"$nulls":6},"(tr. =\"T\")","Fett","Eiweiß",{"$nulls":3},"Bedarf der Kuh"]
[{"$nulls":3},"Anzahl","Datum","kg","kg/Tag","%","%",{"$nulls":3},"TM",{"$f":"+N14","v":"Ca"},{"$f":"+O14","v":"P"},"Na","Mg",{"$f":"+R14","v":"K"},"Se",{"$f":"+T14","v":"DCAB"}]
[{"$nulls":3},{"$f":"[0]!LakNr","v":0},{"$f":"LaktTag","v":0},{"$f":"+'Ration Milch'!I11","v":0},{"$f":"M_kg","v":0},{"$f":"+'Ration Milch'!K11","v":{"v":0,"d":"0.0"}},{"$f":"+'Ration Milch'!L11","v":{"v":0,"d":"0.0"}},{"$nulls":3},"kg",{"$f":"+N15","v":"g "},"g","g","g",{"$f":"+R15","v":"g"},"mg",{"$f":"+T15","v":"meq"}]
[{"$nulls":8},"Erhaltungsbedarf (je kg TM)",{"$nulls":3},{"$f":"+M37","v":{"v":0,"d":"0.0"}},{"v":2,"d":"2.0"},1.4,0.7,0.8,1.8,0.2]
[{"$nulls":11},"Summe Erhaltung",null,{"$f":"+N7*$M$7","v":0},0,0,0,0,0]
[null,null,0,{"$nulls":5},"Leistungsbedarf (je kg Milch)",{"$nulls":4},2.5,1.4,0.5,0.4,1.4]
[{"$nulls":11},"Summe  Leistung",null,{"$f":"+IF($G$6=\"t\",13,$G$6*N9)","v":0},{"$f":"+IF($G$6=\"t\",7,$G$6*O9)","v":0},{"$f":"+IF($G$6=\"t\",9,$G$6*P9)","v":0},{"$f":"+IF($G$6=\"t\",2,$G$6*Q9)","v":0},{"$f":"+IF($G$6=\"t\",2,$G$6*R9)","v":0},{"$f":"+IF($G$6=\"t\",0,$G$6*S9)","v":0}]
[{"$nulls":13},{"$f":"N10+N8","v":0},0,0,0,0,0,{"$f":"IF(M_kg=\"T\",\"<\"&DCAB_t_max,DCAB_lakt_min&\"-\"&DCAB_lakt_max)","v":"200-350"}]
[]
[null,"Futterart",null,null,"Gehalt je kg TM im Futter",{"$nulls":7},"Gehalt der Ration"]
[{"$nulls":3},"TS",{"$f":"Futterwerte!T6","v":"Ca"},{"$f":"Futterwerte!U6","v":"P"},{"$f":"Futterwerte!V6","v":"Na"},{"$f":"Futterwerte!W6","v":"Mg"},{"$f":"Futterwerte!X6","v":"K"},{"$f":"Futterwerte!Y6","v":"Se"},{"$f":"Futterwerte!Z6","v":"DCAB"},{"$f":"'Ration Milch'!V18","v":"FM"},{"$f":"'Ration Milch'!W18","v":"TM"},{"$f":"+E14","v":"Ca"},{"$f":"+F14","v":"P"},"Na","Mg","K","Se",{"$f":"+K14","v":"DCAB"}]
[null,null,"Grobfutter","%","g ","g","g","g","g","mg","meq",{"$f":"'Ration Milch'!V19","v":"kg"},{"$f":"'Ration Milch'!W19","v":"kg"},{"$f":"E15","v":"g "},{"$f":"F15","v":"g"},"g","g","g","mg","meq"]
[null,{"$f":"+'Ration Milch'!C20","v":47},{"$f":"INDEX(Tabelle,$B16,1)","v":0},{"$f":"IF(INDEX(Tabelle,$B16,2)=\"\",\"\",INDEX(Tabelle,$B16,2)/10)","v":""},{"$f":"ROUND(INDEX(Tabelle,$B16,19),1)","v":{"v":0,"d":"0.0"}},{"$f":"ROUND(INDEX(Tabelle,$B16,20),1)","v":{"v":0,"d":"0.0"}},{"$f":"ROUND(INDEX(Tabelle,$B16,21),1)","v":{"v":0,"d":"0.0"}},{"$f":"ROUND(INDEX(Tabelle,$B16,22),1)","v":{"v":0,"d":"0.0"}},{"$f":"ROUND(INDEX(Tabelle,$B16,23),1)","v":{"v":0,"d":"0.0"}},{"$f":"ROUND(INDEX(Tabelle,$B16,24),1)","v":{"v":0,"d":"0.0"}},{"$f":"ROUND(INDEX(Tabelle,$B16,25),1)","v":{"v":0,"d":"0.0"}},{"$f":"'Ration Milch'!V20","v":{"v":0,"d":"0.00"}},{"$f":"'Ration Milch'!W20","v":{"v":0,"d":"0.00"}},{"$f":"M16*E16","v":{"v":0,"d":"0.0"}},{"$f":"M16*F16","v":{"v":0,"d":"0.0"}},{"$f":"M16*G16","v":{"v":0,"d":"0.0"}},{"$f":"+M16*H16","v":{"v":0,"d":"0.0"}},{"$f":"+M16*I16","v":{"v":0,"d":"0.0"}},{"$f":"+M16*J16","v":{"v":0,"d":"0.0"}},{"$f":"+M16*K16","v":{"v":0,"d":"0.0"}},{"$f":"IF(M16=0,\"\",IF(COUNTIF(C16:J16,0)>0,\"?\",\"\"))","v":""}]
[null,{"$f":"+'Ration Milch'!C21","v":243},0,"",{"v":0,"d":"0.0"},{"v":0,"d":"0.0"},{"v":0,"d":"0.0"},{"v":0,"d":"0.0"},{"v":0,"d":"0.0"},{"v":0,"d":"0.0"},{"v":0,"d":"0.0"},{"$f":"'Ration Milch'!V21","v":{"v":0,"d":"0.00"}},{"$f":"'Ration Milch'!W21","v":{"v":0,"d":"0.00"}},{"v":0,"d":"0.0"},{"v":0,"d":"0.0"},{"v":0,"d":"0.0"},{"v":0,"d":"0.0"},{"v":0,"d":"0.0"},{"v":0,"d":"0.0"},{"v":0,"d":"0.0"},""]
[null,{"$f":"+'Ration Milch'!C22","v":47},0,"",{"v":0,"d":"0.0"},{"v":0,"d":"0.0"},{"v":0,"d":"0.0"},{"v":0,"d":"0.0"},{"v":0,"d":"0.0"},{"v":0,"d":"0.0"},{"v":0,"d":"0.0"},{"$f":"'Ration Milch'!V22","v":{"v":0,"d":"0.00"}},{"$f":"'Ration Milch'!W22","v":{"v":0,"d":"0.00"}},{"v":0,"d":"0.0"},{"v":0,"d":"0.0"},{"v":0,"d":"0.0"},{"v":0,"d":"0.0"},{"v":0,"d":"0.0"},{"v":0,"d":"0.0"},{"v":0,"d":"0.0"},""]
[null,{"$f":"+'Ration Milch'!C23","v":3},0,"",{"v":0,"d":"0.0"},{"v":0,"d":"0.0"},{"v":0,"d":"0.0"},{"v":0,"d":"0.0"},{"v":0,"d":"0.0"},{"v":0,"d":"0.0"},{"v":0,"d":"0.0"},{"$f":"'Ration Milch'!V23","v":{"v":0,"d":"0.00"}},{"$f":"'Ration Milch'!W23","v":{"v":0,"d":"0.00"}},{"v":0,"d":"0.0"},{"v":0,"d":"0.0"},{"v":0,"d":"0.0"},{"v":0,"d":"0.0"},{"v":0,"d":"0.0"},{"v":0,"d":"0.0"},{"v":0,"d":"0.0"},""]
[null,{"$f":"+'Ration Milch'!C24","v":3},0,"",{"v":0,"d":"0.0"},{"v":0,"d":"0.0"},{"v":0,"d":"0.0"},{"v":0,"d":"0.0"},{"v":0,"d":"0.0"},{"v":0,"d":"0.0"},{"v":0,"d":"0.0"},{"$f":"'Ration Milch'!V24","v":{"v":0,"d":"0.00"}},{"$f":"'Ration Milch'!W24","v":{"v":0,"d":"0.00"}},{"v":0,"d":"0.0"},{"v":0,"d":"0.0"},{"v":0,"d":"0.0"},{"v":0,"d":"0.0"},{"v":0,"d":"0.0"},{"v":0,"d":"0.0"},{"v":0,"d":"0.0"},""]
[null,{"$f":"+'Ration Milch'!C25","v":3},0,"",{"v":0,"d":"0.0"},{"v":0,"d":"0.0"},{"v":0,"d":"0.0"},{"v":0,"d":"0.0"},{"v":0,"d":"0.0"},{"v":0,"d":"0.0"},{"v":0,"d":"0.0"},{"$f":"'Ration Milch'!V25","v":{"v":0,"d":"0.00"}},{"$f":"'Ration Milch'!W25","v":{"v":0,"d":"0.00"}},{"v":0,"d":"0.0"},{"v":0,"d":"0.0"},{"v":0,"d":"0.0"},{"v":0,"d":"0.0"},{"v":0,"d":"0.0"},{"v":0,"d":"0.0"},{"v":0,"d":"0.0"},""]
[{"$nulls":10},"Summe",{"$f":"'Ration Milch'!V26","v":{"v":0,"d":"0.0"}},{"$f":"'Ration Milch'!W26","v":{"v":0,"d":"0.0"}},{"$f":"SUM(N16:N21)","v":{"v":0,"d":"0.0"}},{"v":0,"d":"0.0"},{"v":0,"d":"0.0"},{"v":0,"d":"0.0"},{"$f":"SUM(R16:R21)","v":{"v":0,"d":"0.0"}},{"v":0,"d":"0.0"},{"$f":"SUM(T16:T21)","v":{"v":0,"d":"0.0"}}]
[{"$nulls":12},"je kg TM",{"$f":"IF($M$22>0,N22/$M$22,\"\")","v":""},"","","","","",{"$f":"IF($M$22>0,T22/$M$22,\"\")","v":""}]
[null,null,"Rationsausgleich/Mineralfutter",{"$nulls":10},{"$f":"IF(N9=0,0,(N22-N8)/N9)","v":0},{"$f":"IF(O9=0,0,(O22-O8)/O9)","v":0},{"$f":"IF(P9=0,0,(P22-P8)/P9)","v":0},{"$f":"IF(Q9=0,0,(Q22-Q8)/Q9)","v":0},"kg Milch"]
[]
[null,{"$f":"+'Ration Milch'!C29","v":3},{"$f":"INDEX(Tabelle,$B26,1)","v":0},{"$f":"IF(INDEX(Tabelle,$B26,2)=\"\",\"\",INDEX(Tabelle,$B26,2)/10)","v":""},{"$f":"ROUND(INDEX(Tabelle,$B26,19),1)","v":{"v":0,"d":"0.0"}},{"$f":"ROUND(INDEX(Tabelle,$B26,20),1)","v":{"v":0,"d":"0.0"}},{"$f":"ROUND(INDEX(Tabelle,$B26,21),1)","v":{"v":0,"d":"0.0"}},{"$f":"ROUND(INDEX(Tabelle,$B26,22),1)","v":{"v":0,"d":"0.0"}},{"$f":"ROUND(INDEX(Tabelle,$B26,23),1)","v":{"v":0,"d":"0.0"}},{"$f":"ROUND(INDEX(Tabelle,$B26,24),1)","v":{"v":0,"d":"0.0"}},{"$f":"ROUND(INDEX(Tabelle,$B26,25),1)","v":{"v":0,"d":"0.0"}},{"$f":"'Ration Milch'!V29","v":{"v":0,"d":"0.00"}},{"$f":"'Ration Milch'!W29","v":{"v":0,"d":"0.00"}},{"$f":"M26*E26","v":{"v":0,"d":"0.0"}},{"$f":"M26*F26","v":{"v":0,"d":"0.0"}},{"$f":"M26*G26","v":{"v":0,"d":"0.0"}},{"$f":"+M26*H26","v":{"v":0,"d":"0.0"}},{"$f":"+M26*I26","v":{"v":0,"d":"0.0"}},{"$f":"+M26*J26","v":{"v":0,"d":"0.0"}},{"$f":"+M26*K26","v":{"v":0,"d":"0.0"}},{"$f":"IF(M26=0,\"\",IF(COUNTIF(C26:J26,0)>0,\"?\",\"\"))","v":""}]
[null,{"$f":"+'Ration Milch'!C30","v":3},{"$f":"INDEX(Tabelle,$B27,1)","v":0},{"$f":"IF(INDEX(Tabelle,$B27,2)=\"\",\"\",INDEX(Tabelle,$B27,2)/10)","v":""},{"$f":"ROUND(INDEX(Tabelle,$B27,19),1)","v":{"v":0,"d":"0.0"}},{"$f":"ROUND(INDEX(Tabelle,$B27,20),1)","v":{"v":0,"d":"0.0"}},{"$f":"ROUND(INDEX(Tabelle,$B27,21),1)","v":{"v":0,"d":"0.0"}},{"$f":"ROUND(INDEX(Tabelle,$B27,22),1)","v":{"v":0,"d":"0.0"}},{"$f":"ROUND(INDEX(Tabelle,$B27,23),1)","v":{"v":0,"d":"0.0"}},{"$f":"ROUND(INDEX(Tabelle,$B27,24),1)","v":{"v":0,"d":"0.0"}},{"$f":"ROUND(INDEX(Tabelle,$B27,25),1)","v":{"v":0,"d":"0.0"}},{"$f":"'Ration Milch'!V30","v":{"v":0,"d":"0.00"}},{"$f":"'Ration Milch'!W30","v":{"v":0,"d":"0.00"}},{"$f":"M27*E27","v":{"v":0,"d":"0.0"}},{"$f":"M27*F27","v":{"v":0,"d":"0.0"}},{"$f":"M27*G27","v":{"v":0,"d":"0.0"}},{"$f":"+M27*H27","v":{"v":0,"d":"0.0"}},{"$f":"+M27*I27","v":{"v":0,"d":"0.0"}},{"$f":"+M27*J27","v":{"v":0,"d":"0.0"}},{"v":0,"d":"0.0"},{"$f":"IF(M27=0,\"\",IF(COUNTIF(C27:J27,0)>0,\"?\",\"\"))","v":""}]
[null,{"$f":"+'Ration Milch'!C31","v":3},{"$f":"INDEX(Tabelle,$B28,1)","v":0},{"$f":"IF(INDEX(Tabelle,$B28,2)=\"\",\"\",INDEX(Tabelle,$B28,2)/10)","v":""},{"$f":"ROUND(INDEX(Tabelle,$B28,19),1)","v":{"v":0,"d":"0.0"}},{"$f":"ROUND(INDEX(Tabelle,$B28,20),1)","v":{"v":0,"d":"0.0"}},{"$f":"ROUND(INDEX(Tabelle,$B28,21),1)","v":{"v":0,"d":"0.0"}},{"$f":"ROUND(INDEX(Tabelle,$B28,22),1)","v":{"v":0,"d":"0.0"}},{"$f":"ROUND(INDEX(Tabelle,$B28,23),1)","v":{"v":0,"d":"0.0"}},{"$f":"ROUND(INDEX(Tabelle,$B28,24),1)","v":{"v":0,"d":"0.0"}},{"$f":"ROUND(INDEX(Tabelle,$B28,25),1)","v":{"v":0,"d":"0.0"}},{"$f":"'Ration Milch'!V31","v":{"v":0,"d":"0.00"}},{"$f":"'Ration Milch'!W31","v":{"v":0,"d":"0.00"}},{"$f":"M28*E28","v":{"v":0,"d":"0.0"}},{"$f":"M28*F28","v":{"v":0,"d":"0.0"}},{"$f":"M28*G28","v":{"v":0,"d":"0.0"}},{"$f":"+M28*H28","v":{"v":0,"d":"0.0"}},{"$f":"+M28*I28","v":{"v":0,"d":"0.0"}},{"$f":"+M28*J28","v":{"v":0,"d":"0.0"}},{"v":0,"d":"0.0"},{"$f":"IF(M28=0,\"\",IF(COUNTIF(C28:J28,0)>0,\"?\",\"\"))","v":""}]
[null,{"$f":"+'Ration Milch'!C32","v":3},{"$f":"INDEX(Tabelle,$B29,1)","v":0},{"$f":"IF(INDEX(Tabelle,$B29,2)=\"\",\"\",INDEX(Tabelle,$B29,2)/10)","v":""},{"$f":"ROUND(INDEX(Tabelle,$B29,19),1)","v":{"v":0,"d":"0.0"}},{"$f":"ROUND(INDEX(Tabelle,$B29,20),1)","v":{"v":0,"d":"0.0"}},{"$f":"ROUND(INDEX(Tabelle,$B29,21),1)","v":{"v":0,"d":"0.0"}},{"$f":"ROUND(INDEX(Tabelle,$B29,22),1)","v":{"v":0,"d":"0.0"}},{"$f":"ROUND(INDEX(Tabelle,$B29,23),1)","v":{"v":0,"d":"0.0"}},{"$f":"ROUND(INDEX(Tabelle,$B29,24),1)","v":{"v":0,"d":"0.0"}},{"$f":"ROUND(INDEX(Tabelle,$B29,25),1)","v":{"v":0,"d":"0.0"}},{"$f":"'Ration Milch'!V32","v":{"v":0,"d":"0.00"}},{"$f":"'Ration Milch'!W32","v":{"v":0,"d":"0.00"}},{"$f":"M29*E29","v":{"v":0,"d":"0.0"}},{"$f":"M29*F29","v":{"v":0,"d":"0.0"}},{"$f":"M29*G29","v":{"v":0,"d":"0.0"}},{"$f":"+M29*H29","v":{"v":0,"d":"0.0"}},{"$f":"+M29*I29","v":{"v":0,"d":"0.0"}},{"$f":"+M29*J29","v":{"v":0,"d":"0.0"}},{"v":0,"d":"0.0"},{"$f":"IF(M29=0,\"\",IF(COUNTIF(C29:J29,0)>0,\"?\",\"\"))","v":""}]
[{"$nulls":10},"Summe",{"$f":"'Ration Milch'!V33","v":{"v":0,"d":"0.0"}},{"$f":"'Ration Milch'!W33","v":{"v":0,"d":"0.0"}},{"$f":"SUM(N26:N29)+N22","v":{"v":0,"d":"0.0"}},{"v":0,"d":"0.0"},{"v":0,"d":"0.0"},{"v":0,"d":"0.0"},{"v":0,"d":"0.0"},{"v":0,"d":"0.0"},{"$f":"SUM(T26:T29)+T22","v":{"v":0,"d":"0.0"}}]
[{"$nulls":12},"je kg TM",{"$f":"IF($M$30>0,N30/$M$30,\"\")","v":""},"","","","","",{"$f":"IF($M$30>0,T30/$M$30,\"\")","v":""}]
[null,null,"Milchleistungsfutter",{"$nulls":10},{"$f":"IF(N$9=0,0,(N30-N$8)/N$9)","v":0},{"$f":"IF(O$9=0,0,(O30-O$8)/O$9)","v":0},{"$f":"IF(P$9=0,0,(P30-P$8)/P$9)","v":0},{"$f":"IF(Q$9=0,0,(Q30-Q$8)/Q$9)","v":0},"kg Milch"]
[]
[null,{"$f":"+'Ration Milch'!C37","v":3},{"$f":"INDEX(Tabelle,$B34,1)","v":0},{"$f":"IF(INDEX(Tabelle,$B34,2)=\"\",\"\",INDEX(Tabelle,$B34,2)/10)","v":""},{"$f":"ROUND(INDEX(Tabelle,$B34,19),1)","v":{"v":0,"d":"0.0"}},{"$f":"ROUND(INDEX(Tabelle,$B34,20),1)","v":{"v":0,"d":"0.0"}},{"$f":"ROUND(INDEX(Tabelle,$B34,21),1)","v":{"v":0,"d":"0.0"}},{"$f":"ROUND(INDEX(Tabelle,$B34,22),1)","v":{"v":0,"d":"0.0"}},{"$f":"ROUND(INDEX(Tabelle,$B34,23),1)","v":{"v":0,"d":"0.0"}},{"$f":"ROUND(INDEX(Tabelle,$B34,24),1)","v":{"v":0,"d":"0.0"}},{"$f":"ROUND(INDEX(Tabelle,$B34,25),1)","v":{"v":0,"d":"0.0"}},{"$f":"'Ration Milch'!V37","v":{"v":0,"d":"0.00"}},{"$f":"'Ration Milch'!W37","v":{"v":0,"d":"0.00"}},{"$f":"M34*E34","v":{"v":0,"d":"0.0"}},{"$f":"M34*F34","v":{"v":0,"d":"0.0"}},{"$f":"M34*G34","v":{"v":0,"d":"0.0"}},{"$f":"+M34*H34","v":{"v":0,"d":"0.0"}},{"$f":"+M34*I34","v":{"v":0,"d":"0.0"}},{"$f":"+M34*J34","v":{"v":0,"d":"0.0"}},{"$f":"+M34*K34","v":{"v":0,"d":"0.0"}},{"$f":"IF(M34=0,\"\",IF(COUNTIF(C34:J34,0)>0,\"?\",\"\"))","v":""}]
[null,{"$f":"+'Ration Milch'!C38","v":3},{"$f":"INDEX(Tabelle,$B35,1)","v":0},{"$f":"IF(INDEX(Tabelle,$B35,2)=\"\",\"\",INDEX(Tabelle,$B35,2)/10)","v":""},{"$f":"ROUND(INDEX(Tabelle,$B35,19),1)","v":{"v":0,"d":"0.0"}},{"$f":"ROUND(INDEX(Tabelle,$B35,20),1)","v":{"v":0,"d":"0.0"}},{"$f":"ROUND(INDEX(Tabelle,$B35,21),1)","v":{"v":0,"d":"0.0"}},{"$f":"ROUND(INDEX(Tabelle,$B35,22),1)","v":{"v":0,"d":"0.0"}},{"$f":"ROUND(INDEX(Tabelle,$B35,23),1)","v":{"v":0,"d":"0.0"}},{"$f":"ROUND(INDEX(Tabelle,$B35,24),1)","v":{"v":0,"d":"0.0"}},{"$f":"ROUND(INDEX(Tabelle,$B35,25),1)","v":{"v":0,"d":"0.0"}},{"$f":"'Ration Milch'!V38","v":{"v":0,"d":"0.00"}},{"$f":"'Ration Milch'!W38","v":{"v":0,"d":"0.00"}},{"$f":"M35*E35","v":{"v":0,"d":"0.0"}},{"$f":"M35*F35","v":{"v":0,"d":"0.0"}},{"$f":"M35*G35","v":{"v":0,"d":"0.0"}},{"$f":"+M35*H35","v":{"v":0,"d":"0.0"}},{"$f":"+M35*I35","v":{"v":0,"d":"0.0"}},{"$f":"+M35*J35","v":{"v":0,"d":"0.0"}},{"v":0,"d":"0.0"},{"$f":"IF(M35=0,\"\",IF(COUNTIF(C35:J35,0)>0,\"?\",\"\"))","v":""}]
[{"$nulls":11},{"$f":"'Ration Milch'!V39","v":"FM kg"},{"$f":"'Ration Milch'!W39","v":"TM kg"},{"$f":"N14&\"                   \"&N15","v":"Ca                   g "},{"$f":"O14&\"                   \"&O15","v":"P                   g"},"Na                   g","Mg                   g","K                   g",{"$f":"S14&\"                \"&S15","v":"Se                mg"},{"$f":"T14&\"         \"&T15","v":"DCAB         meq"}]
[{"$nulls":10},"Summe",{"$f":"'Ration Milch'!V40","v":{"v":0,"d":"0.0"}},{"$f":"'Ration Milch'!W40","v":{"v":0,"d":"0.0"}},{"$f":"N30+N34+N35","v":0},0,0,0,{"$f":"R30+R34+R35","v":0},{"$f":"S30+S34+S35","v":0},{"$f":"T30+T34+T35","v":0}]
[{"$nulls":12},"je kg TM",{"$f":"IF($M$37>0,N37/$M$37,\"\")","v":""},"","","","","",{"$f":"IF($M$37>0,T37/$M$37,\"\")","v":""}]
[{"$nulls":12},"reicht für ... kg Milch",{"$f":"IF(N$9=0,0,(N37-N$8)/N$9)","v":0},0,0,0,0,0,{"$f":"IF(T$9=0,0,(T37-T$8)/T$9)","v":0}]
[{"$nulls":12},"Bedarfsdeckung",{"$f":"IF(N11=0,\"\",+N37/N11)","v":""},"","","","","","-"]
[]
[{"$f":"'Zuteilung-Milchleistungsfutter'!$A$50","v":"UniRat 2022, © W. Sekul, LAZBW Aulendorf             Die Daten sind auf Plausibilität zu prüfen, um Eingabe- und Berechnungsfehler auszuschließen. Es wird keine Gewähr zur Richtigkeit der Daten übernommen."}]

{"sheet":"Zuteilung-Milchleistungsfutter","index":6,"n_rows":50,"n_cols":32,"rows_kept":50,"merged":[[0,0,0,31],[3,9,3,10],[3,29,3,30],[5,9,5,10],[5,29,5,30],[7,9,7,10],[9,9,9,10],[11,9,11,10],[13,9,13,10],[15,0,15,6],[17,0,17,8],[17,9,17,10],[19,10,19,12]]}
["Kraftfutterliste - Abruffütterung"]
[]
[{"$nulls":31},{"$f":"'Ration Milch'!$Z$34","v":""}]
["Rasse (HF, FV, BV)",{"$nulls":8},"FV",{"$nulls":19},"Milchleistungsfutter \n(Abruffütterung)",null,191]
[{"$nulls":31},{"$f":"INDEX(Tabelle,AF$4,3)","v":4}]
["Leistungsniveau, kg ECM",{"$nulls":8},9000,{"$nulls":19},"Ausgleichskraftfutter\n(Abruffütterung)",null,191]
[]
["Laktationsnr.",{"$nulls":8},2,{"$nulls":19},"Ausgleich ab kg Milch"]
[]
["Lebendmasse, kg",{"$nulls":8},650,{"$nulls":19},"Ausgleichskraftfutter, kg/Tag (fix)"]
[{"$nulls":31},{"$f":"INDEX(Tabelle,AF$4,2)/1000","v":0.86}]
["Fett %",{"$nulls":8},4,{"$nulls":19},"NFCmax",null,{"v":380,"d":"380g/kg TM"}]
[{"$nulls":31},0]
["Eiweiß %",{"$nulls":8},3.6,{"$nulls":19},"MLFmin\n(AMS)",null,{"$f":"AF13*100","v":{"v":0,"d":"0 g"}}]
[{"$nulls":31},30]
[{"$nulls":29},"MLFmax, i.d.TM (Abruffütterung)",null,{"$f":"AF15/100","v":{"v":0.3,"d":"30%"}}]
[{"$nulls":9},{"$f":"INDEX(Tabelle,AF$6,3)","v":4},{"$nulls":21},100]
["Grundration, incl. Rationsausgleich \n(Trogration, \"Ration Milch\")",{"$nulls":8},{"$f":"'Ration Milch'!X34","v":""},null,{"$f":"'Ration Milch'!AA34","v":""},{"$nulls":17},"Korrektur\nTM-Aufnahme",null,{"$f":"AF17/100","v":{"v":1,"d":"100%"}}]
[{"$nulls":9},{"$f":"INDEX(Tabelle,AF$6,2)/1000","v":0.86}]
["Milchleistung","ECM","Lakttag","Konz.pred.","MLFTransges.","TM-Aufnahme","TM-Trogration","TM-Grobfutter","KF-Anteil\nTrogration","AusgleichsKF\n(FM)","MLF-Transponder\n(FM)",null,null,"KF-Gesamt","NEL\nMJ/kg TM","nXP\ng/kg TM","RNB\ng/Tag","NFC\ng/kg TM","SW\n/kg TM\n","ADF\ng/kg TM","NDF\ng/kg TM",null,"Ca\ng","P\ng","Na\ng","Mg\ng","K\ng","Se\ng","NEL-Bilanz\nMJ","LM-Veränderung\ng/Tag","Kosten","KF-Effizienz"]
[{"$f":"IF(MLF_LakTag1=7000,14,IF(MLF_LakTag1=9000,16,IF(MLF_LakTag1=11000,18, \"Eingabefehler - ECM\")))","v":{"v":16,"d":"16 kg"}},{"$f":"A21*(MLF_Fett1*0.38+MLF_Prot1*0.21+1.05)/3.28","v":{"v":16.224390243902437,"d":"16.2 kg"}},{"$f":"IF(MLF_LakTag1=7000,273,IF(MLF_LakTag1=9000,301,336))","v":{"v":301,"d":"301.00 "}},{"$f":"MAX(IF(MLF_LakTag1=7000,0.00000240679*B21^5-0.00034272276*B21^4+0.01751018612*B21^3-0.38414129327*B21^2+3.70025873859*B21-12.83588,IF(MLF_LakTag1=9000,0.00000227834*B21^5-0.00033174803*B21^4+0.01734743992*B21^3-0.38912715564*B21^2+3.8067140359*B21-13.1978,IF(MLF_LakTag1=11000,0.00000354922*B21^5-0.00053511787*B21^4+0.02970736291*B21^3-0.74031250256*B21^2+8.39997601052*B21-35.30319754533))),J21)","v":0},{"$f":"IF(IF(MLF_KFmax1/MLF_Kf_TS1*$F21<((($B21*3.28+MLF_LM1^0.75*0.293)/$F21)-MLF_GF_NEL1)/(MLF_KF_NEL1-MLF_GF_NEL1)*$F21/MLF_Kf_TS1,MLF_KFmax1/MLF_Kf_TS1*$F21,IF(((($B21*3.28+MLF_LM1^0.75*0.293)/$F21)-MLF_GF_NEL1)/(MLF_KF_NEL1-MLF_GF_NEL1)*$F21/MLF_Kf_TS1<0,0,((($B21*3.28+MLF_LM1^0.75*0.293)/$F21)-MLF_GF_NEL1)/(MLF_KF_NEL1-MLF_GF_NEL1)*$F21/MLF_Kf_TS1))<MLF_KFmin1/1000,MLF_KFmin1/1000,IF(MLF_KFmax1/MLF_Kf_TS1*$F21<((($B21*3.28+MLF_LM1^0.75*0.293)/$F21)-MLF_GF_NEL1)/(MLF_KF_NEL1-MLF_GF_NEL1)*$F21/MLF_Kf_TS1,MLF_KFmax1/MLF_Kf_TS1*$F21,IF(((($B21*3.28+MLF_LM1^0.75*0.293)/$F21)-MLF_GF_NEL1)/(MLF_KF_NEL1-MLF_GF_NEL1)*$F21/MLF_Kf_TS1<0,0,((($B21*3.28+MLF_LM1^0.75*0.293)/$F21)-MLF_GF_NEL1)/(MLF_KF_NEL1-MLF_GF_NEL1)*$F21/MLF_Kf_TS1)))","v":{"$error":"#VALUE!"}},{"$f":"IF(OR(MLF_LakNr1=\"\",C21=\"\",MLF_LM1=\"\",MLF_Rasse1=\"\",MLF_Fett1=\"\",MLF_Prot1=\"\"),\"\",(3.878+IF(MLF_Rasse1=\"HF\",-2.19,IF(MLF_Rasse1=\"FV\",-2.631,-1.826))+IF(MLF_LakNr1=1,-0.728,0.218)+(-4.287+4.153*(1-EXP(-0.01486*C21)))+MLF_LM1*(0.0148-0.0000474*C21+0.0000000904*C21^2)+B21*(0.0825+0.0008098*C21-0.000000966*C21^2)+D21*(0.6962-0.0023289*C21+0.0000040634*C21^2)+0.858*MLF_GF_NEL1)*0.93+0.47)*MLF_ITkorr1","v":{"$error":"#VALUE!"}},{"$f":"(F21-MLF_Kf_TS1*E21)","v":{"$error":"#VALUE!"}},{"$f":"F21-N21","v":{"$error":"#VALUE!"}},{"$f":"((TM_Grundration-TM_GF)/TM_Grundration)*G21","v":{"$error":"#DIV/0!"}},{"$f":"IF(A21<MLF_AF_Milch1,0,MLF_AF_max1)","v":{"v":0,"d":"0.0 kg"}},{"$f":"R21","v":{"$error":"#VALUE!"}},{"$f":"IF(($E21*MLF_Kf_TS1*MLF_KF_NEL1-$J21*MLF_AF_NEL1*MLF_AF_TS1)/(MLF_KF_NEL1*MLF_Kf_TS1)<0,0,($E21*MLF_Kf_TS1*MLF_KF_NEL1-$J21*MLF_AF_NEL1*MLF_AF_TS1)/(MLF_KF_NEL1*MLF_Kf_TS1))","v":{"$error":"#VALUE!"}},{"$f":"R21","v":{"$error":"#VALUE!"}},{"$f":"I21+J21*INDEX(Tabelle,MLF_AF_Art1,2)/1000+L21*INDEX(Tabelle,MLF_Art_1,2)/1000","v":{"$error":"#DIV/0!"}},{"$f":"($G21*MLF_GF_NEL1+$J21*INDEX(Tabelle,MLF_AF_Art1,3)/AF_TS1+$L21*INDEX(Tabelle,MLF_Art_1,3)/MLF_Kf_TS1)/$F21","v":{"$error":"#VALUE!"}},{"$f":"($G21*GR_nXP+$J21*INDEX(Tabelle,MLF_AF_Art1,7)*$J$19+$L21*INDEX(Tabelle,MLF_Art_1,7)*MLF_Kf_TS1)/$F21","v":{"$error":"#VALUE!"}},{"$f":"$G21*GR_RNB+$J21*INDEX(Tabelle,MLF_AF_Art1,8)*$J$19+$L21*INDEX(Tabelle,MLF_Art_1,8)*MLF_Kf_TS1","v":{"$error":"#VALUE!"}},{"$f":"($G21*GR_NFC+$J21*INDEX(Tabelle,MLF_AF_Art1,12)*$J$19+$L21*INDEX(Tabelle,MLF_Art_1,12)*MLF_Kf_TS1)/$F21","v":{"$error":"#VALUE!"}},{"$f":"($G21*GR_SW+$J21*INDEX(Tabelle,MLF_AF_Art1,9)*AF_TS1+$L21*INDEX(Tabelle,MLF_Art_1,9)*MLF_Kf_TS1)/$F21","v":{"$error":"#VALUE!"}},{"$f":"($G21*GR_ADF+$J21*INDEX(Tabelle,MLF_AF_Art1,10)*$J$19+$L21*INDEX(Tabelle,MLF_Art_1,10)*MLF_Kf_TS1)/$F21","v":{"$error":"#VALUE!"}},{"$f":"($G21*GR_NDF+$J21*INDEX(Tabelle,MLF_AF_Art1,11)*$J$19+$L21*INDEX(Tabelle,MLF_Art_1,11)*MLF_Kf_TS1)/$F21","v":{"$error":"#VALUE!"}},null,{"$f":"($G21*GR_Ca+$J21*INDEX(Tabelle,MLF_AF_Art1,19)*$J$19+$L21*INDEX(Tabelle,MLF_Art_1,19)*MLF_Kf_TS1)/$F21","v":{"$error":"#VALUE!"}},{"$f":"($G21*GR_P+$J21*INDEX(Tabelle,MLF_AF_Art1,20)*$J$19+$L21*INDEX(Tabelle,MLF_Art_1,20)*MLF_Kf_TS1)/$F21","v":{"$error":"#VALUE!"}},{"$f":"($G21*GR_Na+$J21*INDEX(Tabelle,MLF_AF_Art1,21)*$J$19+$L21*INDEX(Tabelle,MLF_Art_1,21)*MLF_Kf_TS1)/$F21","v":{"$error":"#VALUE!"}},{"$f":"($G21*GR_Mg+$J21*INDEX(Tabelle,MLF_AF_Art1,22)*$J$19+$L21*INDEX(Tabelle,MLF_Art_1,22)*MLF_Kf_TS1)/$F21","v":{"$error":"#VALUE!"}},{"$f":"($G21*GR_K+$J21*INDEX(Tabelle,MLF_AF_Art1,23)*$J$19+$L21*INDEX(Tabelle,MLF_Art_1,23)*MLF_Kf_TS1)/$F21","v":{"$error":"#VALUE!"}},{"$f":"($G21*GR_Se+$J21*INDEX(Tabelle,MLF_AF_Art1,24)*$J$19+$L21*INDEX(Tabelle,MLF_Art_1,24)*MLF_Kf_TS1)/$F21","v":{"$error":"#VALUE!"}},{"$f":"G21*MLF_GF_NEL1+J21*MLF_AF_NEL1*MLF_AF_TS1+L21*MLF_KF_NEL1*MLF_Kf_TS1-B21*3.28-MLF_LM1^0.75*0.293","v":{"$error":"#VALUE!"}},{"$f":"IF(AC21>0,AC21/25.5*1000,AC21/21*1000)","v":{"$error":"#VALUE!"}},{"$f":"G21*Kosten_TM+J21*INDEX(Tabelle,MLF_AF_Art1,25)/100+L21*INDEX(Tabelle,MLF_Art_1,25)/100","v":{"$error":"#VALUE!"}},{"$f":"N21/0.88/(A21*(J$12*0.38+J$14*0.21+1.05)/3.28)*1000","v":{"$error":"#DIV/0!"}}]
[{"$f":"A21+1","v":{"v":17,"d":"17 kg"}},{"v":17.23841463414634,"d":"17.2 kg"},{"$f":"AVERAGE(C21,C23)","v":{"v":294,"d":"294.00 "}},0,{"$error":"#VALUE!"},{"$error":"#VALUE!"},{"$error":"#VALUE!"},{"$error":"#VALUE!"},{"$f":"((TM_Grundration-TM_GF)/TM_Grundration)*G22","v":{"$error":"#DIV/0!"}},{"v":0,"d":"0.0 kg"},{"$f":"R22","v":{"$error":"#VALUE!"}},{"$error":"#VALUE!"},{"$f":"R22","v":{"$error":"#VALUE!"}},{"$error":"#DIV/0!"},{"$error":"#VALUE!"},{"$error":"#VALUE!"},{"$error":"#VALUE!"},{"$error":"#VALUE!"},{"$error":"#VALUE!"},{"$error":"#VALUE!"},{"$error":"#VALUE!"},null,{"$error":"#VALUE!"},{"$error":"#VALUE!"},{"$error":"#VALUE!"},{"$error":"#VALUE!"},{"$error":"#VALUE!"},{"$error":"#VALUE!"},{"$error":"#VALUE!"},{"$f":"IF(AC22>0,AC22/25.5*1000,AC22/21*1000)","v":{"$error":"#VALUE!"}},{"$error":"#VALUE!"},{"$f":"N22/0.88/(A22*(J$12*0.38+J$14*0.21+1.05)/3.28)*1000","v":{"$error":"#DIV/0!"}}]
[{"$f":"A22+1","v":{"v":18,"d":"18 kg"}},{"v":18.252439024390245,"d":"18.3 kg"},{"$f":"IF(MLF_LakTag1=7000,252,IF(MLF_LakTag1=9000,287,336))","v":{"v":287,"d":"287.00 "}},0,{"$error":"#VALUE!"},{"$error":"#VALUE!"},{"$error":"#VALUE!"},{"$error":"#VALUE!"},{"$error":"#DIV/0!"},{"v":0,"d":"0.0 kg"},{"$f":"R23","v":{"$error":"#VALUE!"}},{"$error":"#VALUE!"},{"$f":"R23","v":{"$error":"#VALUE!"}},{"$error":"#DIV/0!"},{"$error":"#VALUE!"},{"$error":"#VALUE!"},{"$error":"#VALUE!"},{"$error":"#VALUE!"},{"$error":"#VALUE!"},{"$error":"#VALUE!"},{"$error":"#VALUE!"},null,{"$error":"#VALUE!"},{"$error":"#VALUE!"},{"$error":"#VALUE!"},{"$error":"#VALUE!"},{"$error":"#VALUE!"},{"$error":"#VALUE!"},{"$error":"#VALUE!"},{"$error":"#VALUE!"},{"$error":"#VALUE!"},{"$error":"#DIV/0!"}]
[{"v":19,"d":"19 kg"},{"v":19.266463414634146,"d":"19.3 kg"},{"$f":"AVERAGE(C23,C25)","v":{"v":280,"d":"280.00 "}},{"v":0.10187569358032533,"d":"0.10 "},{"$error":"#VALUE!"},{"$error":"#VALUE!"},{"$error":"#VALUE!"},{"$error":"#VALUE!"},{"$error":"#DIV/0!"},{"v":0,"d":"0.0 kg"},{"$error":"#VALUE!"},{"$error":"#VALUE!"},{"$error":"#VALUE!"},{"$error":"#DIV/0!"},{"$error":"#VALUE!"},{"$error":"#VALUE!"},{"$error":"#VALUE!"},{"$error":"#VALUE!"},{"$error":"#VALUE!"},{"$error":"#VALUE!"},{"$error":"#VALUE!"},null,{"$error":"#VALUE!"},{"$error":"#VALUE!"},{"$error":"#VALUE!"},{"$error":"#VALUE!"},{"$error":"#VALUE!"},{"$error":"#VALUE!"},{"$error":"#VALUE!"},{"$error":"#VALUE!"},{"$error":"#VALUE!"},{"$error":"#DIV/0!"}]
[{"v":20,"d":"20 kg"},{"v":20.28048780487805,"d":"20.3 kg"},{"$f":"IF(MLF_LakTag1=7000,231,IF(MLF_LakTag1=9000,273,336))","v":{"v":273,"d":"273.00 "}},{"v":0.3535226198521144,"d":"0.35 "},{"$error":"#VALUE!"},{"$error":"#VALUE!"},{"$error":"#VALUE!"},{"$error":"#VALUE!"},{"$error":"#DIV/0!"},{"v":0,"d":"0.0 kg"},{"$error":"#VALUE!"},{"$error":"#VALUE!"},{"$error":"#VALUE!"},{"$error":"#DIV/0!"},{"$error":"#VALUE!"},{"$error":"#VALUE!"},{"$error":"#VALUE!"},{"$error":"#VALUE!"},{"$error":"#VALUE!"},{"$error":"#VALUE!"},{"$error":"#VALUE!"},null,{"$error":"#VALUE!"},{"$error":"#VALUE!"},{"$error":"#VALUE!"},{"$error":"#VALUE!"},{"$error":"#VALUE!"},{"$error":"#VALUE!"},{"$error":"#VALUE!"},{"$error":"#VALUE!"},{"$error":"#VALUE!"},{"$error":"#DIV/0!"}]
[{"v":21,"d":"21 kg"},{"v":21.29451219512195,"d":"21.3 kg"},{"$f":"AVERAGE(C25,C27)","v":{"v":266,"d":"266.00 "}},{"v":0.6824371413705137,"d":"0.68 "},{"$error":"#VALUE!"},{"$error":"#VALUE!"},{"$error":"#VALUE!"},{"$error":"#VALUE!"},{"$error":"#DIV/0!"},{"v":0,"d":"0.0 kg"},{"$error":"#VALUE!"},{"$error":"#VALUE!"},{"$error":"#VALUE!"},{"$error":"#DIV/0!"},{"$error":"#VALUE!"},{"$error":"#VALUE!"},{"$error":"#VALUE!"},{"$error":"#VALUE!"},{"$error":"#VALUE!"},{"$error":"#VALUE!"},{"$error":"#VALUE!"},null,{"$error":"#VALUE!"},{"$error":"#VALUE!"},{"$error":"#VALUE!"},{"$error":"#VALUE!"},{"$error":"#VALUE!"},{"$error":"#VALUE!"},{"$error":"#VALUE!"},{"$error":"#VALUE!"},{"$error":"#VALUE!"},{"$error":"#DIV/0!"}]
[{"v":22,"d":"22 kg"},{"v":22.308536585365854,"d":"22.3 kg"},{"$f":"IF(MLF_LakTag1=7000,203,IF(MLF_LakTag1=9000,259,336))","v":{"v":259,"d":"259.00 "}},{"v":1.0862020309474474,"d":"1.09 "},{"$error":"#VALUE!"},{"$error":"#VALUE!"},{"$error":"#VALUE!"},{"$error":"#VALUE!"},{"$error":"#DIV/0!"},{"v":0,"d":"0.0 kg"},{"$error":"#VALUE!"},{"$error":"#VALUE!"},{"$error":"#VALUE!"},{"$error":"#DIV/0!"},{"$error":"#VALUE!"},{"$error":"#VALUE!"},{"$error":"#VALUE!"},{"$error":"#VALUE!"},{"$error":"#VALUE!"},{"$error":"#VALUE!"},{"$error":"#VALUE!"},null,{"$error":"#VALUE!"},{"$error":"#VALUE!"},{"$error":"#VALUE!"},{"$error":"#VALUE!"},{"$error":"#VALUE!"},{"$error":"#VALUE!"},{"$error":"#VALUE!"},{"$error":"#VALUE!"},{"$error":"#VALUE!"},{"$error":"#DIV/0!"}]
[{"v":23,"d":"23 kg"},{"v":23.322560975609754,"d":"23.3 kg"},{"$f":"AVERAGE(C27,C29)","v":{"v":248.5,"d":"248.50 "}},{"v":1.5601374465338864,"d":"1.56 "},{"$error":"#VALUE!"},{"$error":"#VALUE!"},{"$error":"#VALUE!"},{"$error":"#VALUE!"},{"$error":"#DIV/0!"},{"v":0,"d":"0.0 kg"},{"$error":"#VALUE!"},{"$error":"#VALUE!"},{"$error":"#VALUE!"},{"$error":"#DIV/0!"},{"$error":"#VALUE!"},{"$error":"#VALUE!"},{"$error":"#VALUE!"},{"$error":"#VALUE!"},{"$error":"#VALUE!"},{"$error":"#VALUE!"},{"$error":"#VALUE!"},null,{"$error":"#VALUE!"},{"$error":"#VALUE!"},{"$error":"#VALUE!"},{"$error":"#VALUE!"},{"$error":"#VALUE!"},{"$error":"#VALUE!"},{"$error":"#VALUE!"},{"$error":"#VALUE!"},{"$error":"#VALUE!"},{"$error":"#DIV/0!"}]
[{"v":24,"d":"24 kg"},{"v":24.336585365853654,"d":"24.3 kg"},{"$f":"IF(MLF_LakTag1=7000,175,IF(MLF_LakTag1=9000,238,336))","v":{"v":238,"d":"238.00 "}},{"v":2.097594048745975,"d":"2.10 "},{"$error":"#VALUE!"},{"$error":"#VALUE!"},{"$error":"#VALUE!"},{"$error":"#VALUE!"},{"$error":"#DIV/0!"},{"v":0,"d":"0.0 kg"},{"$error":"#VALUE!"},{"$error":"#VALUE!"},{"$error":"#VALUE!"},{"$error":"#DIV/0!"},{"$error":"#VALUE!"},{"$error":"#VALUE!"},{"$error":"#VALUE!"},{"$error":"#VALUE!"},{"$error":"#VALUE!"},{"$error":"#VALUE!"},{"$error":"#VALUE!"},null,{"$error":"#VALUE!"},{"$error":"#VALUE!"},{"$error":"#VALUE!"},{"$error":"#VALUE!"},{"$error":"#VALUE!"},{"$error":"#VALUE!"},{"$error":"#VALUE!"},{"$error":"#VALUE!"},{"$error":"#VALUE!"},{"$error":"#DIV/0!"}]
[{"v":25,"d":"25 kg"},{"v":25.35060975609756,"d":"25.4 kg"},{"$f":"AVERAGE(C29,C31)","v":{"v":227.5,"d":"227.50 "}},{"v":2.6902461183914426,"d":"2.69 "},{"$error":"#VALUE!"},{"$error":"#VALUE!"},{"$error":"#VALUE!"},{"$error":"#VALUE!"},{"$error":"#DIV/0!"},{"v":0,"d":"0.0 kg"},{"$error":"#VALUE!"},{"$error":"#VALUE!"},{"$error":"#VALUE!"},{"$error":"#DIV/0!"},{"$error":"#VALUE!"},{"$error":"#VALUE!"},{"$error":"#VALUE!"},{"$error":"#VALUE!"},{"$error":"#VALUE!"},{"$error":"#VALUE!"},{"$error":"#VALUE!"},null,{"$error":"#VALUE!"},{"$error":"#VALUE!"},{"$error":"#VALUE!"},{"$error":"#VALUE!"},{"$error":"#VALUE!"},{"$error":"#VALUE!"},{"$error":"#VALUE!"},{"$error":"#VALUE!"},{"$error":"#VALUE!"},{"$error":"#DIV/0!"}]
[{"v":26,"d":"26 kg"},{"v":26.36463414634146,"d":"26.4 kg"},{"$f":"IF(MLF_LakTag1=7000,140,IF(MLF_LakTag1=9000,217,329))","v":{"v":217,"d":"217.00 "}},{"v":3.3283846739959415,"d":"3.33 "},{"$error":"#VALUE!"},{"$error":"#VALUE!"},{"$error":"#VALUE!"},{"$error":"#VALUE!"},{"$error":"#DIV/0!"},{"v":0,"d":"0.0 kg"},{"$error":"#VALUE!"},{"$error":"#VALUE!"},{"$error":"#VALUE!"},{"$error":"#DIV/0!"},{"$error":"#VALUE!"},{"$error":"#VALUE!"},{"$error":"#VALUE!"},{"$error":"#VALUE!"},{"$error":"#VALUE!"},{"$error":"#VALUE!"},{"$error":"#VALUE!"},null,{"$error":"#VALUE!"},{"$error":"#VALUE!"},{"$error":"#VALUE!"},{"$error":"#VALUE!"},{"$error":"#VALUE!"},{"$error":"#VALUE!"},{"$error":"#VALUE!"},{"$error":"#VALUE!"},{"$error":"#VALUE!"},{"$error":"#DIV/0!"}]
[{"v":27,"d":"27 kg"},{"v":27.378658536585366,"d":"27.4 kg"},{"$f":"AVERAGE(C31,C33)","v":{"v":203,"d":"203.00 "}},{"v":4.001210589329304,"d":"4.00 "},{"$error":"#VALUE!"},{"$error":"#VALUE!"},{"$error":"#VALUE!"},{"$error":"#VALUE!"},{"$error":"#DIV/0!"},{"v":0,"d":"0.0 kg"},{"$error":"#VALUE!"},{"$error":"#VALUE!"},{"$error":"#VALUE!"},{"$error":"#DIV/0!"},{"$error":"#VALUE!"},{"$error":"#VALUE!"},{"$error":"#VALUE!"},{"$error":"#VALUE!"},{"$error":"#VALUE!"},{"$error":"#VALUE!"},{"$error":"#VALUE!"},null,{"$error":"#VALUE!"},{"$error":"#VALUE!"},{"$error":"#VALUE!"},{"$error":"#VALUE!"},{"$error":"#VALUE!"},{"$error":"#VALUE!"},{"$error":"#VALUE!"},{"$error":"#VALUE!"},{"$error":"#VALUE!"},{"$error":"#DIV/0!"}]
[{"v":28,"d":"28 kg"},{"v":28.392682926829266,"d":"28.4 kg"},{"$f":"IF(MLF_LakTag1=7000,119,IF(MLF_LakTag1=9000,189,315))","v":{"v":189,"d":"189.00 "}},{"v":4.697127710931682,"d":"4.70 "},{"$error":"#VALUE!"},{"$error":"#VALUE!"},{"$error":"#VALUE!"},{"$error":"#VALUE!"},{"$error":"#DIV/0!"},{"v":0,"d":"0.0 kg"},{"$error":"#VALUE!"},{"$error":"#VALUE!"},{"$error":"#VALUE!"},{"$f":"I33+J33*INDEX(Tabelle,MLF_AF_Art1,2)/1000+L33*INDEX(Tabelle,MLF_Art_1,2)/1000","v":{"$error":"#DIV/0!"}},{"$error":"#VALUE!"},{"$error":"#VALUE!"},{"$error":"#VALUE!"},{"$error":"#VALUE!"},{"$error":"#VALUE!"},{"$error":"#VALUE!"},{"$error":"#VALUE!"},null,{"$error":"#VALUE!"},{"$error":"#VALUE!"},{"$error":"#VALUE!"},{"$error":"#VALUE!"},{"$error":"#VALUE!"},{"$error":"#VALUE!"},{"$error":"#VALUE!"},{"$error":"#VALUE!"},{"$error":"#VALUE!"},{"$error":"#DIV/0!"}]
[{"v":29,"d":"29 kg"},{"v":29.40670731707317,"d":"29.4 kg"},{"$f":"AVERAGE(C33,C35)","v":{"v":171.5,"d":"171.50 "}},{"v":5.404035975640397,"d":"5.40 "},{"$error":"#VALUE!"},{"$error":"#VALUE!"},{"$error":"#VALUE!"},{"$error":"#VALUE!"},{"$error":"#DIV/0!"},{"v":0,"d":"0.0 kg"},{"$error":"#VALUE!"},{"$error":"#VALUE!"},{"$error":"#VALUE!"},{"$error":"#DIV/0!"},{"$error":"#VALUE!"},{"$error":"#VALUE!"},{"$error":"#VALUE!"},{"$error":"#VALUE!"},{"$error":"#VALUE!"},{"$error":"#VALUE!"},{"$error":"#VALUE!"},null,{"$error":"#VALUE!"},{"$error":"#VALUE!"},{"$error":"#VALUE!"},{"$error":"#VALUE!"},{"$error":"#VALUE!"},{"$error":"#VALUE!"},{"$error":"#VALUE!"},{"$error":"#VALUE!"},{"$error":"#VALUE!"},{"$error":"#DIV/0!"}]
[{"v":30,"d":"30 kg"},{"v":30.42073170731707,"d":"30.4 kg"},{"$f":"IF(MLF_LakTag1=7000,98,IF(MLF_LakTag1=9000,154,294))","v":{"v":154,"d":"154.00 "}},{"v":6.1096245281155745,"d":"6.11 "},{"$error":"#VALUE!"},{"$error":"#VALUE!"},{"$error":"#VALUE!"},{"$error":"#VALUE!"},{"$error":"#DIV/0!"},{"v":0,"d":"0.0 kg"},{"$error":"#VALUE!"},{"$error":"#VALUE!"},{"$error":"#VALUE!"},{"$error":"#DIV/0!"},{"$error":"#VALUE!"},{"$error":"#VALUE!"},{"$error":"#VALUE!"},{"$error":"#VALUE!"},{"$error":"#VALUE!"},{"$error":"#VALUE!"},{"$error":"#VALUE!"},null,{"$error":"#VALUE!"},{"$error":"#VALUE!"},{"$error":"#VALUE!"},{"$error":"#VALUE!"},{"$error":"#VALUE!"},{"$error":"#VALUE!"},{"$error":"#VALUE!"},{"$error":"#VALUE!"},{"$error":"#VALUE!"},{"$error":"#DIV/0!"}]
[{"v":31,"d":"31 kg"},{"v":31.434756097560975,"d":"31.4 kg"},{"$f":"AVERAGE(C35,C37)","v":{"v":140,"d":"140.00 "}},{"v":6.80166483836679,"d":"6.80 "},{"$error":"#VALUE!"},{"$error":"#VALUE!"},{"$error":"#VALUE!"},{"$error":"#VALUE!"},{"$error":"#DIV/0!"},{"v":0,"d":"0.0 kg"},{"$error":"#VALUE!"},{"$error":"#VALUE!"},{"$error":"#VALUE!"},{"$error":"#DIV/0!"},{"$error":"#VALUE!"},{"$error":"#VALUE!"},{"$error":"#VALUE!"},{"$error":"#VALUE!"},{"$error":"#VALUE!"},{"$error":"#VALUE!"},{"$error":"#VALUE!"},null,{"$error":"#VALUE!"},{"$error":"#VALUE!"},{"$error":"#VALUE!"},{"$error":"#VALUE!"},{"$error":"#VALUE!"},{"$error":"#VALUE!"},{"$error":"#VALUE!"},{"$error":"#VALUE!"},{"$error":"#VALUE!"},{"$error":"#DIV/0!"}]
[{"v":32,"d":"32 kg"},{"v":32.448780487804875,"d":"32.4 kg"},{"$f":"IF(MLF_LakTag1=7000,77,IF(MLF_LakTag1=9000,126,266))","v":{"v":126,"d":"126.00 "}},{"v":7.468303819279413,"d":"7.47 "},{"$error":"#VALUE!"},{"$error":"#VALUE!"},{"$error":"#VALUE!"},{"$error":"#VALUE!"},{"$error":"#DIV/0!"},{"v":0,"d":"0.0 kg"},{"$error":"#VALUE!"},{"$error":"#VALUE!"},{"$error":"#VALUE!"},{"$error":"#DIV/0!"},{"$error":"#VALUE!"},{"$error":"#VALUE!"},{"$error":"#VALUE!"},{"$error":"#VALUE!"},{"$error":"#VALUE!"},{"$error":"#VALUE!"},{"$error":"#VALUE!"},null,{"$error":"#VALUE!"},{"$error":"#VALUE!"},{"$error":"#VALUE!"},{"$error":"#VALUE!"},{"$error":"#VALUE!"},{"$error":"#VALUE!"},{"$error":"#VALUE!"},{"$error":"#VALUE!"},{"$error":"#VALUE!"},{"$error":"#DIV/0!"}]
[{"v":33,"d":"33 kg"},{"v":33.46280487804878,"d":"33.5 kg"},{"$f":"AVERAGE(C37,C39)","v":{"v":115.5,"d":"115.50 "}},{"v":8.098356944140889,"d":"8.10 "},{"$error":"#VALUE!"},{"$error":"#VALUE!"},{"$error":"#VALUE!"},{"$error":"#VALUE!"},{"$error":"#DIV/0!"},{"v":0,"d":"0.0 kg"},{"$error":"#VALUE!"},{"$error":"#VALUE!"},{"$error":"#VALUE!"},{"$error":"#DIV/0!"},{"$error":"#VALUE!"},{"$error":"#VALUE!"},{"$error":"#VALUE!"},{"$error":"#VALUE!"},{"$error":"#VALUE!"},{"$error":"#VALUE!"},{"$error":"#VALUE!"},null,{"$error":"#VALUE!"},{"$error":"#VALUE!"},{"$error":"#VALUE!"},{"$error":"#VALUE!"},{"$error":"#VALUE!"},{"$error":"#VALUE!"},{"$error":"#VALUE!"},{"$error":"#VALUE!"},{"$error":"#VALUE!"},{"$error":"#DIV/0!"}]
[{"v":34,"d":"34 kg"},{"v":34.47682926829268,"d":"34.5 kg"},{"$f":"IF(MLF_LakTag1=7000,63,IF(MLF_LakTag1=9000,105,231))","v":{"v":105,"d":"105.00 "}},{"v":8.681601364167108,"d":"8.68 "},{"$error":"#VALUE!"},{"$error":"#VALUE!"},{"$error":"#VALUE!"},{"$error":"#VALUE!"},{"$error":"#DIV/0!"},{"v":0,"d":"0.0 kg"},{"$error":"#VALUE!"},{"$error":"#VALUE!"},{"$error":"#VALUE!"},{"$error":"#DIV/0!"},{"$error":"#VALUE!"},{"$error":"#VALUE!"},{"$error":"#VALUE!"},{"$error":"#VALUE!"},{"$error":"#VALUE!"},{"$error":"#VALUE!"},{"$error":"#VALUE!"},null,{"$error":"#VALUE!"},{"$error":"#VALUE!"},{"$error":"#VALUE!"},{"$error":"#VALUE!"},{"$error":"#VALUE!"},{"$error":"#VALUE!"},{"$error":"#VALUE!"},{"$error":"#VALUE!"},{"$error":"#VALUE!"},{"$error":"#DIV/0!"}]
[{"v":35,"d":"35 kg"},{"v":35.49085365853658,"d":"35.5 kg"},{"$f":"AVERAGE(C39,C41)","v":{"v":98,"d":"98.00 "}},{"v":9.209069026028317,"d":"9.21 "},{"$error":"#VALUE!"},{"$error":"#VALUE!"},{"$error":"#VALUE!"},{"$error":"#VALUE!"},{"$error":"#DIV/0!"},{"v":0,"d":"0.0 kg"},{"$error":"#VALUE!"},{"$error":"#VALUE!"},{"$error":"#VALUE!"},{"$error":"#DIV/0!"},{"$error":"#VALUE!"},{"$error":"#VALUE!"},{"$error":"#VALUE!"},{"$error":"#VALUE!"},{"$error":"#VALUE!"},{"$error":"#VALUE!"},{"$error":"#VALUE!"},null,{"$error":"#VALUE!"},{"$error":"#VALUE!"},{"$error":"#VALUE!"},{"$error":"#VALUE!"},{"$error":"#VALUE!"},{"$error":"#VALUE!"},{"$error":"#VALUE!"},{"$error":"#VALUE!"},{"$error":"#VALUE!"},{"$error":"#DIV/0!"}]
[{"v":36,"d":"36 kg"},{"v":36.50487804878049,"d":"36.5 kg"},{"$f":"IF(MLF_LakTag1=7000,42,IF(MLF_LakTag1=9000,91,161))","v":{"v":91,"d":"91.00 "}},{"v":9.67333978937583,"d":"9.67 "},{"$error":"#VALUE!"},{"$error":"#VALUE!"},{"$error":"#VALUE!"},{"$error":"#VALUE!"},{"$error":"#DIV/0!"},{"v":0,"d":"0.0 kg"},{"$error":"#VALUE!"},{"$error":"#VALUE!"},{"$error":"#VALUE!"},{"$error":"#DIV/0!"},{"$error":"#VALUE!"},{"$error":"#VALUE!"},{"$error":"#VALUE!"},{"$error":"#VALUE!"},{"$error":"#VALUE!"},{"$error":"#VALUE!"},{"$error":"#VALUE!"},null,{"$error":"#VALUE!"},{"$error":"#VALUE!"},{"$error":"#VALUE!"},{"$error":"#VALUE!"},{"$error":"#VALUE!"},{"$error":"#VALUE!"},{"$error":"#VALUE!"},{"$error":"#VALUE!"},{"$error":"#VALUE!"},{"$error":"#DIV/0!"}]
[{"v":37,"d":"37 kg"},{"v":37.51890243902439,"d":"37.5 kg"},{"$f":"AVERAGE(C41,C43)","v":{"v":84,"d":"84.00 "}},{"v":10.068834544368116,"d":"10.07 "},{"$error":"#VALUE!"},{"$error":"#VALUE!"},{"$error":"#VALUE!"},{"$error":"#VALUE!"},{"$error":"#DIV/0!"},{"v":0,"d":"0.0 kg"},{"$error":"#VALUE!"},{"$error":"#VALUE!"},{"$error":"#VALUE!"},{"$error":"#DIV/0!"},{"$error":"#VALUE!"},{"$error":"#VALUE!"},{"$error":"#VALUE!"},{"$error":"#VALUE!"},{"$error":"#VALUE!"},{"$error":"#VALUE!"},{"$error":"#VALUE!"},null,{"$error":"#VALUE!"},{"$error":"#VALUE!"},{"$error":"#VALUE!"},{"$error":"#VALUE!"},{"$error":"#VALUE!"},{"$error":"#VALUE!"},{"$error":"#VALUE!"},{"$error":"#VALUE!"},{"$error":"#VALUE!"},{"$error":"#DIV/0!"}]
[{"v":38,"d":"38 kg"},{"v":38.53292682926829,"d":"38.5 kg"},{"$f":"IF(MLF_LakTag1=7000,42,IF(MLF_LakTag1=9000,77,126))","v":{"v":77,"d":"77.00 "}},{"v":10.39210832919801,"d":"10.39 "},{"$error":"#VALUE!"},{"$error":"#VALUE!"},{"$error":"#VALUE!"},{"$error":"#VALUE!"},{"$error":"#DIV/0!"},{"v":0,"d":"0.0 kg"},{"$error":"#VALUE!"},{"$error":"#VALUE!"},{"$error":"#VALUE!"},{"$error":"#DIV/0!"},{"$error":"#VALUE!"},{"$error":"#VALUE!"},{"$error":"#VALUE!"},{"$error":"#VALUE!"},{"$error":"#VALUE!"},{"$error":"#VALUE!"},{"$error":"#VALUE!"},null,{"$error":"#VALUE!"},{"$error":"#VALUE!"},{"$error":"#VALUE!"},{"$error":"#VALUE!"},{"$error":"#VALUE!"},{"$error":"#VALUE!"},{"$error":"#VALUE!"},{"$error":"#VALUE!"},{"$error":"#VALUE!"},{"$error":"#DIV/0!"}]
[{"v":39,"d":"39 kg"},{"v":39.546951219512195,"d":"39.5 kg"},{"$f":"AVERAGE(C43,C45)","v":{"v":70,"d":"70.00 "}},{"v":10.642143447617201,"d":"10.64 "},{"$error":"#VALUE!"},{"$error":"#VALUE!"},{"$error":"#VALUE!"},{"$error":"#VALUE!"},{"$error":"#DIV/0!"},{"v":0,"d":"0.0 kg"},{"$error":"#VALUE!"},{"$error":"#VALUE!"},{"$error":"#VALUE!"},{"$error":"#DIV/0!"},{"$error":"#VALUE!"},{"$error":"#VALUE!"},{"$error":"#VALUE!"},{"$error":"#VALUE!"},{"$error":"#VALUE!"},{"$error":"#VALUE!"},{"$error":"#VALUE!"},null,{"$error":"#VALUE!"},{"$error":"#VALUE!"},{"$error":"#VALUE!"},{"$error":"#VALUE!"},{"$error":"#VALUE!"},{"$error":"#VALUE!"},{"$error":"#VALUE!"},{"$error":"#VALUE!"},{"$error":"#VALUE!"},{"$error":"#DIV/0!"}]
[{"v":40,"d":"40 kg"},{"v":40.5609756097561,"d":"40.6 kg"},{"$f":"IF(MLF_LakTag1=7000,42,IF(MLF_LakTag1=9000,63,91))","v":{"v":63,"d":"63.00 "}},{"v":10.820642586464146,"d":"10.82 "},{"$error":"#VALUE!"},{"$error":"#VALUE!"},{"$error":"#VALUE!"},{"$error":"#VALUE!"},{"$error":"#DIV/0!"},{"v":0,"d":"0.0 kg"},{"$error":"#VALUE!"},{"$error":"#VALUE!"},{"$error":"#VALUE!"},{"$error":"#DIV/0!"},{"$error":"#VALUE!"},{"$error":"#VALUE!"},{"$error":"#VALUE!"},{"$error":"#VALUE!"},{"$error":"#VALUE!"},{"$error":"#VALUE!"},{"$error":"#VALUE!"},null,{"$error":"#VALUE!"},{"$error":"#VALUE!"},{"$error":"#VALUE!"},{"$error":"#VALUE!"},{"$error":"#VALUE!"},{"$error":"#VALUE!"},{"$error":"#VALUE!"},{"$error":"#VALUE!"},{"$error":"#VALUE!"},{"$error":"#DIV/0!"}]
[{"v":41,"d":"41 kg"},{"v":41.574999999999996,"d":"41.6 kg"},{"$f":"AVERAGE(C45,C47)","v":{"v":56,"d":"56.00 "}},{"v":10.9323219331894,"d":"10.93 "},{"$error":"#VALUE!"},{"$error":"#VALUE!"},{"$error":"#VALUE!"},{"$error":"#VALUE!"},{"$error":"#DIV/0!"},{"v":0,"d":"0.0 kg"},{"$error":"#VALUE!"},{"$error":"#VALUE!"},{"$error":"#VALUE!"},{"$error":"#DIV/0!"},{"$error":"#VALUE!"},{"$error":"#VALUE!"},{"$error":"#VALUE!"},{"$error":"#VALUE!"},{"$error":"#VALUE!"},{"$error":"#VALUE!"},{"$error":"#VALUE!"},null,{"$error":"#VALUE!"},{"$error":"#VALUE!"},{"$error":"#VALUE!"},{"$error":"#VALUE!"},{"$error":"#VALUE!"},{"$error":"#VALUE!"},{"$error":"#VALUE!"},{"$error":"#VALUE!"},{"$error":"#VALUE!"},{"$error":"#DIV/0!"}]
[{"v":42,"d":"42 kg"},{"v":42.5890243902439,"d":"42.6 kg"},{"$f":"IF(MLF_LakTag1=7000,42,IF(MLF_LakTag1=9000,49,56))","v":{"v":49,"d":"49.00 "}},{"v":10.985204293382907,"d":"10.99 "},{"$error":"#VALUE!"},{"$error":"#VALUE!"},{"$error":"#VALUE!"},{"$error":"#VALUE!"},{"$error":"#DIV/0!"},{"v":0,"d":"0.0 kg"},{"$error":"#VALUE!"},{"$error":"#VALUE!"},{"$error":"#VALUE!"},{"$error":"#DIV/0!"},{"$error":"#VALUE!"},{"$error":"#VALUE!"},{"$error":"#VALUE!"},{"$error":"#VALUE!"},{"$error":"#VALUE!"},{"$error":"#VALUE!"},{"$error":"#VALUE!"},null,{"$error":"#VALUE!"},{"$error":"#VALUE!"},{"$error":"#VALUE!"},{"$error":"#VALUE!"},{"$error":"#VALUE!"},{"$error":"#VALUE!"},{"$error":"#VALUE!"},{"$error":"#VALUE!"},{"$error":"#VALUE!"},{"$error":"#DIV/0!"}]
[{"v":43,"d":"43 kg"},{"v":43.603048780487796,"d":"43.6 kg"},{"$f":"AVERAGE(C47,C49)","v":{"v":49,"d":"49.00 "}},{"v":10.99091220829942,"d":"10.99 "},{"$error":"#VALUE!"},{"$error":"#VALUE!"},{"$error":"#VALUE!"},{"$error":"#VALUE!"},{"$error":"#DIV/0!"},{"v":0,"d":"0.0 kg"},{"$error":"#VALUE!"},{"$error":"#VALUE!"},{"$error":"#VALUE!"},{"$error":"#DIV/0!"},{"$error":"#VALUE!"},{"$error":"#VALUE!"},{"$error":"#VALUE!"},{"$error":"#VALUE!"},{"$error":"#VALUE!"},{"$error":"#VALUE!"},{"$error":"#VALUE!"},null,{"$error":"#VALUE!"},{"$error":"#VALUE!"},{"$error":"#VALUE!"},{"$error":"#VALUE!"},{"$error":"#VALUE!"},{"$error":"#VALUE!"},{"$error":"#VALUE!"},{"$error":"#VALUE!"},{"$error":"#VALUE!"},{"$error":"#DIV/0!"}]
[{"v":44,"d":"44 kg"},{"v":44.61707317073171,"d":"44.6 kg"},{"$f":"IF(MLF_LakTag1=7000,42,IF(MLF_LakTag1=9000,49,42))","v":{"v":49,"d":"49.00 "}},{"v":10.964961072385279,"d":"10.96 "},{"$error":"#VALUE!"},{"$error":"#VALUE!"},{"$error":"#VALUE!"},{"$error":"#VALUE!"},{"$error":"#DIV/0!"},{"v":0,"d":"0.0 kg"},{"$error":"#VALUE!"},{"$error":"#VALUE!"},{"$error":"#VALUE!"},{"$error":"#DIV/0!"},{"$error":"#VALUE!"},{"$error":"#VALUE!"},{"$error":"#VALUE!"},{"$error":"#VALUE!"},{"$error":"#VALUE!"},{"$error":"#VALUE!"},{"$error":"#VALUE!"},null,{"$error":"#VALUE!"},{"$error":"#VALUE!"},{"$error":"#VALUE!"},{"$error":"#VALUE!"},{"$error":"#VALUE!"},{"$error":"#VALUE!"},{"$error":"#VALUE!"},{"$error":"#VALUE!"},{"$error":"#VALUE!"},{"$error":"#DIV/0!"}]
[{"$f":"'Ration Milch'!B50& \"             Die Daten sind auf Plausibilität zu prüfen, um Eingabe- und Berechnungsfehler auszuschließen. Es wird keine Gewähr zur Richtigkeit der Daten übernommen.\"","v":"UniRat 2022, © W. Sekul, LAZBW Aulendorf             Die Daten sind auf Plausibilität zu prüfen, um Eingabe- und Berechnungsfehler auszuschließen. Es wird keine Gewähr zur Richtigkeit der Daten übernommen."}]

{"sheet":"Modul1","index":7,"n_rows":0,"n_cols":0,"rows_kept":0,"hidden":true}

{"sheet":"TMR-Mischplan","index":8,"n_rows":74,"n_cols":59,"rows_kept":74,"merged":[[0,39,0,40],[1,1,1,2],[1,49,2,49],[1,50,2,50],[1,51,2,51],[1,52,2,52],[1,53,2,53],[1,54,2,54],[1,55,2,55],[1,56,2,56],[1,57,2,57],[1,58,2,58],[2,1,2,2],[24,1,24,2],[38,49,38,57],[39,49,39,57],[40,54,40,55],[40,56,40,57]]}
[{"$nulls":38},"Mischplan"]
[{"$nulls":3},{"$f":"Futterwerte!C6","v":"TS"},{"$f":"Futterwerte!D6","v":"NEL"},{"$f":"Futterwerte!E6","v":"ME"},{"$f":"Futterwerte!F6","v":"XP"},{"$f":"Futterwerte!G6","v":"UDP"},{"$f":"Futterwerte!H6","v":"nXP"},{"$f":"Futterwerte!I6","v":"RNB"},{"$f":"Futterwerte!G6","v":"UDP"},{"$f":"Futterwerte!J6","v":"SW"},{"$f":"Futterwerte!K6","v":"ADF"},{"$f":"Futterwerte!L6","v":"NDF"},{"$f":"Futterwerte!M6","v":"NFC"},{"$f":"Futterwerte!O6","v":"XZ"},{"$f":"Futterwerte!P6","v":"XL"},{"$f":"Futterwerte!Q6","v":"XF"},{"$f":"Futterwerte!R6","v":"sXF"},{"$f":"Futterwerte!S6","v":"XA"},{"$f":"Futterwerte!T6","v":"Ca"},{"$f":"Futterwerte!U6","v":"P"},{"$f":"Futterwerte!V6","v":"Na"},{"$f":"Futterwerte!W6","v":"Mg"},{"$f":"Futterwerte!X6","v":"K"},{"$f":"Futterwerte!Y6","v":"Se"},{"$f":"Futterwerte!Z6","v":"DCAB"},{"$f":"Futterwerte!AA6","v":"Kosten"},"Mischung 1","Mischung 2","Mischung 3","Mischung 4","Mischung 5","Mischung 6","Mischung 7","Mischung 8","Mischung 9",null,null,{"$f":"AC2","v":"Mischung 1"},"Mischung 2","Mischung 3","Mischung 4","Mischung 5","Mischung 6","Mischung 7","Mischung 8","Mischung 9",null,{"$f":"AN2","v":"Mischung 1"},{"$f":"AO2","v":"Mischung 2"},"Mischung 3","Mischung 4","Mischung 5","Mischung 6","Mischung 7",{"$f":"AU2","v":"Mischung 8"},{"$f":"AV2","v":"Mischung 9"},"Gesamt-verbrauch, kg/Tag"]
[null,"Eingabemodus FM/TM",{"$nulls":26},"TM","TM","TM","TM","TM","TM","TM","TM","TM",null,"Tierzahl",{"$f":"AC25","v":0},0,0,0,0,0,0,0,{"$f":"AK25","v":0}]
[47,{"$f":"INDEX(Tabelle,$A4,1)","v":0},null,{"$f":"IF(INDEX(Tabelle,$A4,2)=0,0,INDEX(Tabelle,$A4,2)/10)","v":{"v":0,"d":"0.0"}},{"$f":"INDEX(Tabelle,$A4,3)","v":{"v":0,"d":"0.0"}},{"$f":"INDEX(Tabelle,$A4,4)","v":{"v":0,"d":"0.0"}},{"$f":"INDEX(Tabelle,$A4,5)","v":0},{"$f":"INDEX(Tabelle,$A4,6)","v":{"v":0,"d":"0.0%"}},{"$f":"INDEX(Tabelle,$A4,7)","v":0},{"$f":"INDEX(Tabelle,$A4,8)","v":{"v":0,"d":"0.0"}},{"$f":"INDEX(Tabelle,$A4,6)","v":{"v":0,"d":"0.00"}},{"$f":"INDEX(Tabelle,$A4,9)","v":{"v":0,"d":"0.0"}},{"$f":"INDEX(Tabelle,$A4,10)","v":0},{"$f":"INDEX(Tabelle,$A4,11)","v":0},{"$f":"INDEX(Tabelle,$A4,12)","v":0},{"$f":"INDEX(Tabelle,$A4,14)","v":0},{"$f":"INDEX(Tabelle,$A4,15)","v":0},{"$f":"INDEX(Tabelle,$A4,16)","v":0},{"$f":"INDEX(Tabelle,$A4,17)","v":{"v":0,"d":"0.0"}},{"$f":"INDEX(Tabelle,$A4,18)","v":0},{"$f":"INDEX(Tabelle,$A4,19)","v":{"v":0,"d":"0.0"}},{"$f":"INDEX(Tabelle,$A4,20)","v":{"v":0,"d":"0.0"}},{"$f":"INDEX(Tabelle,$A4,21)","v":{"v":0,"d":"0.0"}},{"$f":"INDEX(Tabelle,$A4,22)","v":{"v":0,"d":"0.0"}},{"$f":"INDEX(Tabelle,$A4,23)","v":{"v":0,"d":"0.0"}},{"$f":"INDEX(Tabelle,$A4,24)","v":{"v":0,"d":"0.0"}},{"$f":"INDEX(Tabelle,$A4,25)","v":{"v":0,"d":"0.0"}},{"$f":"INDEX(Tabelle,$A4,26)/D4","v":{"$error":"#DIV/0!"}},{"$nulls":10},{"$f":"B4","v":{"v":0,"d":"0.0 kg"}},{"$f":"IF(AC4=0,0,IF(AC$3=\"TM\",AC4/$D4*100,AC4))","v":{"v":0,"d":"0.00 kg"}},{"$f":"IF(AD4=0,0,IF(AD$3=\"TM\",AD4/$D4*100,AD4))","v":{"v":0,"d":"0.00 kg"}},{"v":0,"d":"0.00 kg"},{"v":0,"d":"0.00 kg"},{"v":0,"d":"0.00 kg"},{"v":0,"d":"0.00 kg"},{"v":0,"d":"0.00 kg"},{"v":0,"d":"0.00 kg"},{"v":0,"d":"0.00 kg"},null,{"$f":"AN$3*AN4","v":{"v":0,"d":"0.0 kg"}},{"$f":"AO$3*AO4","v":{"v":0,"d":"0.0 kg"}},{"v":0,"d":"0.0 kg"},{"v":0,"d":"0.0 kg"},{"v":0,"d":"0.0 kg"},{"v":0,"d":"0.0 kg"},{"v":0,"d":"0.0 kg"},{"v":0,"d":"0.0 kg"},{"v":0,"d":"0.0 kg"},{"$f":"SUM(AX4:BF4)","v":{"v":0,"d":"0.0 kg"}}]
[1,0,null,{"v":1E-4,"d":"0.0"},{"v":0,"d":"0.0"},{"v":0,"d":"0.0"},0,{"v":0,"d":"0.0%"},0,{"v":0,"d":"0.0"},{"v":0,"d":"0.00"},{"v":0,"d":"0.0"},0,0,0,0,0,0,{"v":0,"d":"0.0"},0,{"v":0,"d":"0.0"},{"v":0,"d":"0.0"},{"v":0,"d":"0.0"},{"v":0,"d":"0.0"},{"v":0,"d":"0.0"},{"v":0,"d":"0.0"},{"v":0,"d":"0.0"},{"v":0,"d":"0.000"},{"$nulls":10},{"$f":"B5","v":{"v":0,"d":"0.0 kg"}},{"$f":"IF(AC5=0,0,IF(AC$3=\"TM\",AC5/$D5*100,AC5))","v":{"v":0,"d":"0.00 kg"}},{"v":0,"d":"0.00 kg"},{"v":0,"d":"0.00 kg"},{"v":0,"d":"0.00 kg"},{"v":0,"d":"0.00 kg"},{"v":0,"d":"0.00 kg"},{"v":0,"d":"0.00 kg"},{"v":0,"d":"0.00 kg"},{"v":0,"d":"0.00 kg"},null,{"$f":"AN$3*AN5","v":{"v":0,"d":"0.0 kg"}},{"$f":"AO$3*AO5","v":{"v":0,"d":"0.0 kg"}},{"$f":"AP$3*AP5","v":{"v":0,"d":"0.0 kg"}},{"$f":"AQ$3*AQ5","v":{"v":0,"d":"0.0 kg"}},{"$f":"AR$3*AR5","v":{"v":0,"d":"0.0 kg"}},{"$f":"AS$3*AS5","v":{"v":0,"d":"0.0 kg"}},{"$f":"AT$3*AT5","v":{"v":0,"d":"0.0 kg"}},{"$f":"AU$3*AU5","v":{"v":0,"d":"0.0 kg"}},{"$f":"AV$3*AV5","v":{"v":0,"d":"0.0 kg"}},{"$f":"SUM(AX5:BF5)","v":{"v":0,"d":"0.0 kg"}}]
[2,0,null,{"v":0,"d":"0.0"},{"v":0,"d":"0.0"},{"v":0,"d":"0.0"},0,{"v":0,"d":"0.0%"},0,{"v":0,"d":"0.0"},{"v":0,"d":"0.00"},{"v":0,"d":"0.0"},0,0,0,0,0,0,{"v":0,"d":"0.0"},0,{"v":0,"d":"0.0"},{"v":0,"d":"0.0"},{"v":0,"d":"0.0"},{"v":0,"d":"0.0"},{"v":0,"d":"0.0"},{"v":0,"d":"0.0"},{"v":0,"d":"0.0"},{"$error":"#DIV/0!"},{"$nulls":10},{"v":0,"d":"0.0 kg"},{"v":0,"d":"0.00 kg"},{"v":0,"d":"0.00 kg"},{"v":0,"d":"0.00 kg"},{"v":0,"d":"0.00 kg"},{"v":0,"d":"0.00 kg"},{"v":0,"d":"0.00 kg"},{"v":0,"d":"0.00 kg"},{"v":0,"d":"0.00 kg"},{"v":0,"d":"0.00 kg"},null,{"v":0,"d":"0.0 kg"},{"v":0,"d":"0.0 kg"},{"v":0,"d":"0.0 kg"},{"v":0,"d":"0.0 kg"},{"v":0,"d":"0.0 kg"},{"v":0,"d":"0.0 kg"},{"v":0,"d":"0.0 kg"},{"v":0,"d":"0.0 kg"},{"v":0,"d":"0.0 kg"},{"v":0,"d":"0.0 kg"}]
[2,0,null,{"v":0,"d":"0.0"},{"v":0,"d":"0.0"},{"v":0,"d":"0.0"},0,{"v":0,"d":"0.0%"},0,{"v":0,"d":"0.0"},{"v":0,"d":"0.00"},{"v":0,"d":"0.0"},0,0,0,0,0,0,{"v":0,"d":"0.0"},0,{"v":0,"d":"0.0"},{"v":0,"d":"0.0"},{"v":0,"d":"0.0"},{"v":0,"d":"0.0"},{"v":0,"d":"0.0"},{"v":0,"d":"0.0"},{"v":0,"d":"0.0"},{"$error":"#DIV/0!"},{"$nulls":10},{"v":0,"d":"0.0 kg"},{"v":0,"d":"0.00 kg"},{"v":0,"d":"0.00 kg"},{"v":0,"d":"0.00 kg"},{"v":0,"d":"0.00 kg"},{"v":0,"d":"0.00 kg"},{"v":0,"d":"0.00 kg"},{"v":0,"d":"0.00 kg"},{"v":0,"d":"0.00 kg"},{"v":0,"d":"0.00 kg"},null,{"v":0,"d":"0.0 kg"},{"v":0,"d":"0.0 kg"},{"v":0,"d":"0.0 kg"},{"v":0,"d":"0.0 kg"},{"v":0,"d":"0.0 kg"},{"v":0,"d":"0.0 kg"},{"v":0,"d":"0.0 kg"},{"v":0,"d":"0.0 kg"},{"v":0,"d":"0.0 kg"},{"v":0,"d":"0.0 kg"}]
[2,0,null,{"v":0,"d":"0.0"},{"v":0,"d":"0.0"},{"v":0,"d":"0.0"},0,{"v":0,"d":"0.0%"},0,{"v":0,"d":"0.0"},{"v":0,"d":"0.00"},{"v":0,"d":"0.0"},0,0,0,0,0,0,{"v":0,"d":"0.0"},0,{"v":0,"d":"0.0"},{"v":0,"d":"0.0"},{"v":0,"d":"0.0"},{"v":0,"d":"0.0"},{"v":0,"d":"0.0"},{"v":0,"d":"0.0"},{"v":0,"d":"0.0"},{"$error":"#DIV/0!"},{"$nulls":10},{"v":0,"d":"0.0 kg"},{"v":0,"d":"0.00 kg"},{"v":0,"d":"0.00 kg"},{"v":0,"d":"0.00 kg"},{"v":0,"d":"0.00 kg"},{"v":0,"d":"0.00 kg"},{"v":0,"d":"0.00 kg"},{"v":0,"d":"0.00 kg"},{"v":0,"d":"0.00 kg"},{"v":0,"d":"0.00 kg"},null,{"v":0,"d":"0.0 kg"},{"v":0,"d":"0.0 kg"},{"v":0,"d":"0.0 kg"},{"v":0,"d":"0.0 kg"},{"v":0,"d":"0.0 kg"},{"v":0,"d":"0.0 kg"},{"v":0,"d":"0.0 kg"},{"v":0,"d":"0.0 kg"},{"v":0,"d":"0.0 kg"},{"v":0,"d":"0.0 kg"}]
[2,0,null,{"v":0,"d":"0.0"},{"v":0,"d":"0.0"},{"v":0,"d":"0.0"},0,{"v":0,"d":"0.0%"},0,{"v":0,"d":"0.0"},{"v":0,"d":"0.00"},{"v":0,"d":"0.0"},0,0,0,0,0,0,{"v":0,"d":"0.0"},0,{"v":0,"d":"0.0"},{"v":0,"d":"0.0"},{"v":0,"d":"0.0"},{"v":0,"d":"0.0"},{"v":0,"d":"0.0"},{"v":0,"d":"0.0"},{"v":0,"d":"0.0"},{"$error":"#DIV/0!"},{"$nulls":10},{"v":0,"d":"0.0 kg"},{"v":0,"d":"0.00 kg"},{"v":0,"d":"0.00 kg"},{"v":0,"d":"0.00 kg"},{"v":0,"d":"0.00 kg"},{"v":0,"d":"0.00 kg"},{"v":0,"d":"0.00 kg"},{"v":0,"d":"0.00 kg"},{"v":0,"d":"0.00 kg"},{"v":0,"d":"0.00 kg"},null,{"v":0,"d":"0.0 kg"},{"v":0,"d":"0.0 kg"},{"v":0,"d":"0.0 kg"},{"v":0,"d":"0.0 kg"},{"v":0,"d":"0.0 kg"},{"v":0,"d":"0.0 kg"},{"v":0,"d":"0.0 kg"},{"v":0,"d":"0.0 kg"},{"v":0,"d":"0.0 kg"},{"v":0,"d":"0.0 kg"}]
[2,0,null,{"v":0,"d":"0.0"},{"v":0,"d":"0.0"},{"v":0,"d":"0.0"},0,{"v":0,"d":"0.0%"},0,{"v":0,"d":"0.0"},{"v":0,"d":"0.00"},{"v":0,"d":"0.0"},0,0,0,0,0,0,{"v":0,"d":"0.0"},0,{"v":0,"d":"0.0"},{"v":0,"d":"0.0"},{"v":0,"d":"0.0"},{"v":0,"d":"0.0"},{"v":0,"d":"0.0"},{"v":0,"d":"0.0"},{"v":0,"d":"0.0"},{"$error":"#DIV/0!"},{"$nulls":10},{"v":0,"d":"0.0 kg"},{"v":0,"d":"0.00 kg"},{"v":0,"d":"0.00 kg"},{"v":0,"d":"0.00 kg"},{"v":0,"d":"0.00 kg"},{"v":0,"d":"0.00 kg"},{"v":0,"d":"0.00 kg"},{"v":0,"d":"0.00 kg"},{"v":0,"d":"0.00 kg"},{"v":0,"d":"0.00 kg"},null,{"v":0,"d":"0.0 kg"},{"v":0,"d":"0.0 kg"},{"v":0,"d":"0.0 kg"},{"v":0,"d":"0.0 kg"},{"v":0,"d":"0.0 kg"},{"v":0,"d":"0.0 kg"},{"v":0,"d":"0.0 kg"},{"v":0,"d":"0.0 kg"},{"v":0,"d":"0.0 kg"},{"v":0,"d":"0.0 kg"}]
[2,0,null,{"v":0,"d":"0.0"},{"v":0,"d":"0.0"},{"v":0,"d":"0.0"},0,{"v":0,"d":"0.0%"},0,{"v":0,"d":"0.0"},{"v":0,"d":"0.00"},{"v":0,"d":"0.0"},0,0,0,0,0,0,{"v":0,"d":"0.0"},0,{"v":0,"d":"0.0"},{"v":0,"d":"0.0"},{"v":0,"d":"0.0"},{"v":0,"d":"0.0"},{"v":0,"d":"0.0"},{"v":0,"d":"0.0"},{"v":0,"d":"0.0"},{"$error":"#DIV/0!"},{"$nulls":10},{"v":0,"d":"0.0 kg"},{"v":0,"d":"0.00 kg"},{"v":0,"d":"0.00 kg"},{"v":0,"d":"0.00 kg"},{"v":0,"d":"0.00 kg"},{"v":0,"d":"0.00 kg"},{"v":0,"d":"0.00 kg"},{"v":0,"d":"0.00 kg"},{"v":0,"d":"0.00 kg"},{"v":0,"d":"0.00 kg"},null,{"v":0,"d":"0.0 kg"},{"v":0,"d":"0.0 kg"},{"v":0,"d":"0.0 kg"},{"v":0,"d":"0.0 kg"},{"v":0,"d":"0.0 kg"},{"v":0,"d":"0.0 kg"},{"v":0,"d":"0.0 kg"},{"v":0,"d":"0.0 kg"},{"v":0,"d":"0.0 kg"},{"v":0,"d":"0.0 kg"}]
[2,0,null,{"v":0,"d":"0.0"},{"v":0,"d":"0.0"},{"v":0,"d":"0.0"},0,{"v":0,"d":"0.0%"},0,{"v":0,"d":"0.0"},{"v":0,"d":"0.00"},{"v":0,"d":"0.0"},0,0,0,0,0,0,{"v":0,"d":"0.0"},0,{"v":0,"d":"0.0"},{"v":0,"d":"0.0"},{"v":0,"d":"0.0"},{"v":0,"d":"0.0"},{"v":0,"d":"0.0"},{"v":0,"d":"0.0"},{"v":0,"d":"0.0"},{"$error":"#DIV/0!"},{"$nulls":10},{"v":0,"d":"0.0 kg"},{"$f":"IF(AC12=0,0,IF(AC$3=\"TM\",AC12/$D12*100,AC12))","v":{"v":0,"d":"0.00 kg"}},{"v":0,"d":"0.00 kg"},{"v":0,"d":"0.00 kg"},{"v":0,"d":"0.00 kg"},{"v":0,"d":"0.00 kg"},{"v":0,"d":"0.00 kg"},{"v":0,"d":"0.00 kg"},{"v":0,"d":"0.00 kg"},{"v":0,"d":"0.00 kg"},null,{"v":0,"d":"0.0 kg"},{"v":0,"d":"0.0 kg"},{"v":0,"d":"0.0 kg"},{"v":0,"d":"0.0 kg"},{"v":0,"d":"0.0 kg"},{"v":0,"d":"0.0 kg"},{"v":0,"d":"0.0 kg"},{"v":0,"d":"0.0 kg"},{"v":0,"d":"0.0 kg"},{"v":0,"d":"0.0 kg"}]
[2,0,null,{"v":0,"d":"0.0"},{"v":0,"d":"0.0"},{"v":0,"d":"0.0"},0,{"v":0,"d":"0.0%"},0,{"v":0,"d":"0.0"},{"v":0,"d":"0.00"},{"v":0,"d":"0.0"},0,0,0,0,0,0,{"v":0,"d":"0.0"},0,{"v":0,"d":"0.0"},{"v":0,"d":"0.0"},{"v":0,"d":"0.0"},{"v":0,"d":"0.0"},{"v":0,"d":"0.0"},{"v":0,"d":"0.0"},{"v":0,"d":"0.0"},{"$error":"#DIV/0!"},{"$nulls":10},{"v":0,"d":"0.0 kg"},{"v":0,"d":"0.00 kg"},{"v":0,"d":"0.00 kg"},{"v":0,"d":"0.00 kg"},{"v":0,"d":"0.00 kg"},{"v":0,"d":"0.00 kg"},{"v":0,"d":"0.00 kg"},{"v":0,"d":"0.00 kg"},{"v":0,"d":"0.00 kg"},{"v":0,"d":"0.00 kg"},null,{"v":0,"d":"0.0 kg"},{"v":0,"d":"0.0 kg"},{"v":0,"d":"0.0 kg"},{"v":0,"d":"0.0 kg"},{"v":0,"d":"0.0 kg"},{"v":0,"d":"0.0 kg"},{"v":0,"d":"0.0 kg"},{"v":0,"d":"0.0 kg"},{"v":0,"d":"0.0 kg"},{"v":0,"d":"0.0 kg"}]
[2,0,null,{"v":0,"d":"0.0"},{"v":0,"d":"0.0"},{"v":0,"d":"0.0"},0,{"v":0,"d":"0.0%"},0,{"v":0,"d":"0.0"},{"v":0,"d":"0.00"},{"v":0,"d":"0.0"},0,0,0,0,0,0,{"v":0,"d":"0.0"},0,{"v":0,"d":"0.0"},{"v":0,"d":"0.0"},{"v":0,"d":"0.0"},{"v":0,"d":"0.0"},{"v":0,"d":"0.0"},{"v":0,"d":"0.0"},{"v":0,"d":"0.0"},{"$error":"#DIV/0!"},{"$nulls":10},{"v":0,"d":"0.0 kg"},{"v":0,"d":"0.00 kg"},{"v":0,"d":"0.00 kg"},{"v":0,"d":"0.00 kg"},{"v":0,"d":"0.00 kg"},{"v":0,"d":"0.00 kg"},{"v":0,"d":"0.00 kg"},{"v":0,"d":"0.00 kg"},{"v":0,"d":"0.00 kg"},{"v":0,"d":"0.00 kg"},null,{"v":0,"d":"0.0 kg"},{"v":0,"d":"0.0 kg"},{"v":0,"d":"0.0 kg"},{"v":0,"d":"0.0 kg"},{"v":0,"d":"0.0 kg"},{"v":0,"d":"0.0 kg"},{"v":0,"d":"0.0 kg"},{"v":0,"d":"0.0 kg"},{"v":0,"d":"0.0 kg"},{"v":0,"d":"0.0 kg"}]
[2,0,null,{"v":0,"d":"0.0"},{"v":0,"d":"0.0"},{"v":0,"d":"0.0"},0,{"v":0,"d":"0.0%"},0,{"v":0,"d":"0.0"},{"v":0,"d":"0.00"},{"v":0,"d":"0.0"},0,0,0,0,0,0,{"v":0,"d":"0.0"},0,{"v":0,"d":"0.0"},{"v":0,"d":"0.0"},{"v":0,"d":"0.0"},{"v":0,"d":"0.0"},{"v":0,"d":"0.0"},{"v":0,"d":"0.0"},{"v":0,"d":"0.0"},{"$error":"#DIV/0!"},{"$nulls":10},{"v":0,"d":"0.0 kg"},{"v":0,"d":"0.00 kg"},{"v":0,"d":"0.00 kg"},{"v":0,"d":"0.00 kg"},{"v":0,"d":"0.00 kg"},{"v":0,"d":"0.00 kg"},{"v":0,"d":"0.00 kg"},{"v":0,"d":"0.00 kg"},{"v":0,"d":"0.00 kg"},{"v":0,"d":"0.00 kg"},null,{"v":0,"d":"0.0 kg"},{"v":0,"d":"0.0 kg"},{"v":0,"d":"0.0 kg"},{"v":0,"d":"0.0 kg"},{"v":0,"d":"0.0 kg"},{"v":0,"d":"0.0 kg"},{"v":0,"d":"0.0 kg"},{"v":0,"d":"0.0 kg"},{"v":0,"d":"0.0 kg"},{"v":0,"d":"0.0 kg"}]
[2,0,null,{"v":0,"d":"0.0"},{"v":0,"d":"0.0"},{"v":0,"d":"0.0"},0,{"v":0,"d":"0.0%"},0,{"v":0,"d":"0.0"},{"v":0,"d":"0.00"},{"v":0,"d":"0.0"},0,0,0,0,0,0,{"v":0,"d":"0.0"},0,{"v":0,"d":"0.0"},{"v":0,"d":"0.0"},{"v":0,"d":"0.0"},{"v":0,"d":"0.0"},{"v":0,"d":"0.0"},{"v":0,"d":"0.0"},{"v":0,"d":"0.0"},{"$error":"#DIV/0!"},{"$nulls":10},{"v":0,"d":"0.0 kg"},{"v":0,"d":"0.00 kg"},{"v":0,"d":"0.00 kg"},{"v":0,"d":"0.00 kg"},{"v":0,"d":"0.00 kg"},{"v":0,"d":"0.00 kg"},{"v":0,"d":"0.00 kg"},{"v":0,"d":"0.00 kg"},{"v":0,"d":"0.00 kg"},{"v":0,"d":"0.00 kg"},null,{"v":0,"d":"0.0 kg"},{"v":0,"d":"0.0 kg"},{"v":0,"d":"0.0 kg"},{"v":0,"d":"0.0 kg"},{"v":0,"d":"0.0 kg"},{"v":0,"d":"0.0 kg"},{"v":0,"d":"0.0 kg"},{"v":0,"d":"0.0 kg"},{"v":0,"d":"0.0 kg"},{"v":0,"d":"0.0 kg"}]
[2,0,null,{"v":0,"d":"0.0"},{"v":0,"d":"0.0"},{"v":0,"d":"0.0"},0,{"v":0,"d":"0.0%"},0,{"v":0,"d":"0.0"},{"v":0,"d":"0.00"},{"v":0,"d":"0.0"},0,0,0,0,0,0,{"v":0,"d":"0.0"},0,{"v":0,"d":"0.0"},{"v":0,"d":"0.0"},{"v":0,"d":"0.0"},{"v":0,"d":"0.0"},{"v":0,"d":"0.0"},{"v":0,"d":"0.0"},{"v":0,"d":"0.0"},{"$error":"#DIV/0!"},{"$nulls":10},{"v":0,"d":"0.0 kg"},{"v":0,"d":"0.00 kg"},{"v":0,"d":"0.00 kg"},{"v":0,"d":"0.00 kg"},{"v":0,"d":"0.00 kg"},{"v":0,"d":"0.00 kg"},{"v":0,"d":"0.00 kg"},{"v":0,"d":"0.00 kg"},{"v":0,"d":"0.00 kg"},{"v":0,"d":"0.00 kg"},null,{"v":0,"d":"0.0 kg"},{"v":0,"d":"0.0 kg"},{"v":0,"d":"0.0 kg"},{"v":0,"d":"0.0 kg"},{"v":0,"d":"0.0 kg"},{"v":0,"d":"0.0 kg"},{"v":0,"d":"0.0 kg"},{"v":0,"d":"0.0 kg"},{"v":0,"d":"0.0 kg"},{"v":0,"d":"0.0 kg"}]
[2,0,null,{"v":0,"d":"0.0"},{"v":0,"d":"0.0"},{"v":0,"d":"0.0"},0,{"v":0,"d":"0.0%"},0,{"v":0,"d":"0.0"},{"v":0,"d":"0.00"},{"v":0,"d":"0.0"},0,0,0,0,0,0,{"v":0,"d":"0.0"},0,{"v":0,"d":"0.0"},{"v":0,"d":"0.0"},{"v":0,"d":"0.0"},{"v":0,"d":"0.0"},{"v":0,"d":"0.0"},{"v":0,"d":"0.0"},{"v":0,"d":"0.0"},{"$error":"#DIV/0!"},{"$nulls":10},{"v":0,"d":"0.0 kg"},{"v":0,"d":"0.00 kg"},{"v":0,"d":"0.00 kg"},{"v":0,"d":"0.00 kg"},{"v":0,"d":"0.00 kg"},{"v":0,"d":"0.00 kg"},{"v":0,"d":"0.00 kg"},{"v":0,"d":"0.00 kg"},{"v":0,"d":"0.00 kg"},{"v":0,"d":"0.00 kg"},null,{"v":0,"d":"0.0 kg"},{"v":0,"d":"0.0 kg"},{"v":0,"d":"0.0 kg"},{"v":0,"d":"0.0 kg"},{"v":0,"d":"0.0 kg"},{"v":0,"d":"0.0 kg"},{"v":0,"d":"0.0 kg"},{"v":0,"d":"0.0 kg"},{"v":0,"d":"0.0 kg"},{"v":0,"d":"0.0 kg"}]
[2,0,null,{"v":0,"d":"0.0"},{"v":0,"d":"0.0"},{"v":0,"d":"0.0"},0,{"v":0,"d":"0.0%"},0,{"v":0,"d":"0.0"},{"v":0,"d":"0.00"},{"v":0,"d":"0.0"},0,0,0,0,0,0,{"v":0,"d":"0.0"},0,{"v":0,"d":"0.0"},{"v":0,"d":"0.0"},{"v":0,"d":"0.0"},{"v":0,"d":"0.0"},{"v":0,"d":"0.0"},{"v":0,"d":"0.0"},{"v":0,"d":"0.0"},{"$error":"#DIV/0!"},{"$nulls":10},{"v":0,"d":"0.0 kg"},{"v":0,"d":"0.00 kg"},{"v":0,"d":"0.00 kg"},{"v":0,"d":"0.00 kg"},{"v":0,"d":"0.00 kg"},{"v":0,"d":"0.00 kg"},{"v":0,"d":"0.00 kg"},{"v":0,"d":"0.00 kg"},{"v":0,"d":"0.00 kg"},{"v":0,"d":"0.00 kg"},null,{"v":0,"d":"0.0 kg"},{"v":0,"d":"0.0 kg"},{"v":0,"d":"0.0 kg"},{"v":0,"d":"0.0 kg"},{"v":0,"d":"0.0 kg"},{"v":0,"d":"0.0 kg"},{"v":0,"d":"0.0 kg"},{"v":0,"d":"0.0 kg"},{"v":0,"d":"0.0 kg"},{"v":0,"d":"0.0 kg"}]
[2,0,null,{"v":0,"d":"0.0"},{"v":0,"d":"0.0"},{"v":0,"d":"0.0"},0,{"v":0,"d":"0.0%"},0,{"v":0,"d":"0.0"},{"v":0,"d":"0.00"},{"v":0,"d":"0.0"},0,0,0,0,0,0,{"v":0,"d":"0.0"},{"$f":"INDEX(Tabelle,$A21,18)","v":0},{"v":0,"d":"0.0"},{"v":0,"d":"0.0"},{"v":0,"d":"0.0"},{"v":0,"d":"0.0"},{"v":0,"d":"0.0"},{"v":0,"d":"0.0"},{"v":0,"d":"0.0"},{"$error":"#DIV/0!"},{"$nulls":10},{"v":0,"d":"0.0 kg"},{"v":0,"d":"0.00 kg"},{"$f":"IF(AD20=0,0,IF(AD$3=\"TM\",AD20/$D20*100,AD20))","v":{"v":0,"d":"0.00 kg"}},{"v":0,"d":"0.00 kg"},{"v":0,"d":"0.00 kg"},{"v":0,"d":"0.00 kg"},{"v":0,"d":"0.00 kg"},{"v":0,"d":"0.00 kg"},{"v":0,"d":"0.00 kg"},{"v":0,"d":"0.00 kg"},null,{"v":0,"d":"0.0 kg"},{"v":0,"d":"0.0 kg"},{"v":0,"d":"0.0 kg"},{"v":0,"d":"0.0 kg"},{"v":0,"d":"0.0 kg"},{"v":0,"d":"0.0 kg"},{"v":0,"d":"0.0 kg"},{"v":0,"d":"0.0 kg"},{"v":0,"d":"0.0 kg"},{"v":0,"d":"0.0 kg"}]
[2,0,null,{"v":0,"d":"0.0"},{"v":0,"d":"0.0"},{"v":0,"d":"0.0"},0,{"v":0,"d":"0.0%"},0,{"v":0,"d":"0.0"},{"v":0,"d":"0.00"},{"v":0,"d":"0.0"},0,0,0,0,0,0,{"v":0,"d":"0.0"},{"$f":"INDEX(Tabelle,$A21,18)","v":0},{"v":0,"d":"0.0"},{"v":0,"d":"0.0"},{"v":0,"d":"0.0"},{"v":0,"d":"0.0"},{"v":0,"d":"0.0"},{"v":0,"d":"0.0"},{"v":0,"d":"0.0"},{"$error":"#DIV/0!"},{"$nulls":10},{"v":0,"d":"0.0 kg"},{"v":0,"d":"0.00 kg"},{"v":0,"d":"0.00 kg"},{"v":0,"d":"0.00 kg"},{"v":0,"d":"0.00 kg"},{"v":0,"d":"0.00 kg"},{"v":0,"d":"0.00 kg"},{"v":0,"d":"0.00 kg"},{"v":0,"d":"0.00 kg"},{"v":0,"d":"0.00 kg"},null,{"v":0,"d":"0.0 kg"},{"v":0,"d":"0.0 kg"},{"v":0,"d":"0.0 kg"},{"v":0,"d":"0.0 kg"},{"v":0,"d":"0.0 kg"},{"v":0,"d":"0.0 kg"},{"v":0,"d":"0.0 kg"},{"v":0,"d":"0.0 kg"},{"v":0,"d":"0.0 kg"},{"v":0,"d":"0.0 kg"}]
[2,0,null,{"v":0,"d":"0.0"},{"v":0,"d":"0.0"},{"v":0,"d":"0.0"},0,{"v":0,"d":"0.0%"},0,{"v":0,"d":"0.0"},{"v":0,"d":"0.00"},{"v":0,"d":"0.0"},0,0,0,0,0,0,{"v":0,"d":"0.0"},{"$f":"INDEX(Tabelle,$A22,18)","v":0},{"v":0,"d":"0.0"},{"v":0,"d":"0.0"},{"v":0,"d":"0.0"},{"v":0,"d":"0.0"},{"v":0,"d":"0.0"},{"v":0,"d":"0.0"},{"v":0,"d":"0.0"},{"$error":"#DIV/0!"},{"$nulls":10},{"v":0,"d":"0.0 kg"},{"v":0,"d":"0.00 kg"},{"v":0,"d":"0.00 kg"},{"v":0,"d":"0.00 kg"},{"v":0,"d":"0.00 kg"},{"v":0,"d":"0.00 kg"},{"v":0,"d":"0.00 kg"},{"v":0,"d":"0.00 kg"},{"v":0,"d":"0.00 kg"},{"v":0,"d":"0.00 kg"},null,{"v":0,"d":"0.0 kg"},{"v":0,"d":"0.0 kg"},{"v":0,"d":"0.0 kg"},{"v":0,"d":"0.0 kg"},{"v":0,"d":"0.0 kg"},{"v":0,"d":"0.0 kg"},{"v":0,"d":"0.0 kg"},{"v":0,"d":"0.0 kg"},{"v":0,"d":"0.0 kg"},{"v":0,"d":"0.0 kg"}]
[2,0,null,{"v":0,"d":"0.0"},{"v":0,"d":"0.0"},{"v":0,"d":"0.0"},0,{"v":0,"d":"0.0%"},0,{"v":0,"d":"0.0"},{"v":0,"d":"0.00"},{"v":0,"d":"0.0"},0,0,0,0,0,0,{"v":0,"d":"0.0"},{"$f":"INDEX(Tabelle,$A23,18)","v":0},{"v":0,"d":"0.0"},{"v":0,"d":"0.0"},{"v":0,"d":"0.0"},{"v":0,"d":"0.0"},{"v":0,"d":"0.0"},{"v":0,"d":"0.0"},{"v":0,"d":"0.0"},{"$error":"#DIV/0!"},{"$nulls":10},{"v":0,"d":"0.0 kg"},{"v":0,"d":"0.00 kg"},{"v":0,"d":"0.00 kg"},{"v":0,"d":"0.00 kg"},{"v":0,"d":"0.00 kg"},{"v":0,"d":"0.00 kg"},{"v":0,"d":"0.00 kg"},{"v":0,"d":"0.00 kg"},{"v":0,"d":"0.00 kg"},{"v":0,"d":"0.00 kg"},null,{"v":0,"d":"0.0 kg"},{"v":0,"d":"0.0 kg"},{"v":0,"d":"0.0 kg"},{"v":0,"d":"0.0 kg"},{"v":0,"d":"0.0 kg"},{"v":0,"d":"0.0 kg"},{"v":0,"d":"0.0 kg"},{"v":0,"d":"0.0 kg"},{"v":0,"d":"0.0 kg"},{"v":0,"d":"0.0 kg"}]
[63,"Wasser",null,{"v":1E-3,"d":"0.0"},{"v":0,"d":"0.0"},{"v":0,"d":"0.0"},0,{"v":0,"d":"0.0%"},0,{"v":0,"d":"0.0"},null,{"v":1,"d":"1.0"},0,0,0,0,0,0,{"v":0,"d":"0.0"},0,{"v":0,"d":"0.0"},{"v":0,"d":"0.0"},{"v":0,"d":"0.0"},{"v":0,"d":"0.0"},{"v":0,"d":"0.0"},{"v":0,"d":"0.0"},{"v":500,"d":"500.0"},{"v":0,"d":"0.000"},{"$nulls":10},"Wasser",{"v":0,"d":"0.00 kg"},{"v":0,"d":"0.00 kg"},{"v":0,"d":"0.00 kg"},{"v":0,"d":"0.00 kg"},{"v":0,"d":"0.00 kg"},{"v":0,"d":"0.00 kg"},{"v":0,"d":"0.00 kg"},{"v":0,"d":"0.00 kg"},{"v":0,"d":"0.00 kg"},null,{"v":0,"d":"0.0 kg"},{"v":0,"d":"0.0 kg"},{"v":0,"d":"0.0 kg"},{"v":0,"d":"0.0 kg"},{"v":0,"d":"0.0 kg"},{"v":0,"d":"0.0 kg"},{"v":0,"d":"0.0 kg"},{"v":0,"d":"0.0 kg"},{"v":0,"d":"0.0 kg"},{"v":0,"d":"0.0 kg"}]
[null,"Tierzahl",{"$nulls":36},"Summe, kg FM",{"$f":"SUM(AN4:AN24)","v":{"v":0,"d":"0.0"}},{"$f":"SUM(AO4:AO24)","v":{"v":0,"d":"0.0"}},{"v":0,"d":"0.0"},{"v":0,"d":"0.0"},{"v":0,"d":"0.0"},{"v":0,"d":"0.0"},{"v":0,"d":"0.0"},{"v":0,"d":"0.0"},{"v":0,"d":"0.0"},null,{"$f":"SUM(AX4:AX24)","v":0},{"$f":"SUM(AY4:AY24)","v":0},0,0,0,0,0,0,0,0]
[{"$nulls":38},"Summe, kg TM",{"$f":"(AN$4*$D$4+AN$5*$D$5+AN$6*$D$6+AN$7*$D$7+AN$8*$D$8+AN$9*$D$9+AN$10*$D$10+AN$11*$D$11+AN$12*$D$12+AN$13*$D$13+AN$14*$D$14+AN$15*$D$15+AN$16*$D$16+AN$17*$D$17+AN$18*$D$18+AN$19*$D$19+AN$20*$D$20+AN$21*$D$21+AN$22*$D$22+AN$23*$D$23+AN$24*$D$24)/100","v":{"v":0,"d":"0.0"}},{"$f":"(AO$4*$D$4+AO$5*$D$5+AO$6*$D$6+AO$7*$D$7+AO$8*$D$8+AO$9*$D$9+AO$10*$D$10+AO$11*$D$11+AO$12*$D$12+AO$13*$D$13+AO$14*$D$14+AO$15*$D$15+AO$16*$D$16+AO$17*$D$17+AO$18*$D$18+AO$19*$D$19+AO$20*$D$20+AO$21*$D$21+AO$22*$D$22+AO$23*$D$23+AO$24*$D$24)/100","v":{"v":0,"d":"0.0"}},{"v":0,"d":"0.0"},{"v":0,"d":"0.0"},{"v":0,"d":"0.0"},{"v":0,"d":"0.0"},{"v":0,"d":"0.0"},{"v":0,"d":"0.0"},{"v":0,"d":"0.0"},"NFC, g/kg TM",{"$f":"IF(AN$26=0,0,AN54/AN$26)","v":0},0,0,0,0,0,0,0,0]
[{"$nulls":38},"TM, %",{"$f":"IF(AN26=0,\"\",AN26/AN25*100)","v":""},{"$f":"IF(AO26=0,\"\",AO26/AO25*100)","v":""},"","","","","","","","XZ, g/kg TM",0,0,0,0,0,0,0,0,0]
[{"$nulls":38},"MEW NEL, kg ECM650",{"$f":"IF((AN43-37.7)/3.28<5,\"-\",(AN43-37.7)/3.28)","v":"-"},"-","-","-","-","-","-","-","-","XL, g/kg TM",0,0,0,0,0,0,0,0,0]
[{"$nulls":38},"MEW nXP, kg ECM650",{"$f":"IF((AN48-450)/85<5,\"-\",(AN48-450)/85)","v":"-"},"-","-","-","-","-","-","-","-","Ca, g/kg TM",{"$f":"IF(AN$26=0,0,AN62/AN$26)","v":{"v":0,"d":"0.0"}},{"v":0,"d":"0.0"},{"v":0,"d":"0.0"},{"v":0,"d":"0.0"},{"v":0,"d":"0.0"},{"v":0,"d":"0.0"},{"v":0,"d":"0.0"},{"v":0,"d":"0.0"},{"v":0,"d":"0.0"}]
[{"$nulls":38},"NEL MJ /kg TM",{"$f":"IF(AN$26=0,0,AN43/AN$26)","v":{"v":0,"d":"0.00"}},{"v":0,"d":"0.00"},{"v":0,"d":"0.00"},{"v":0,"d":"0.00"},{"v":0,"d":"0.00"},{"v":0,"d":"0.00"},{"v":0,"d":"0.00"},{"v":0,"d":"0.00"},{"v":0,"d":"0.00"},"P, g/kg TM",{"v":0,"d":"0.0"},{"v":0,"d":"0.0"},{"v":0,"d":"0.0"},{"v":0,"d":"0.0"},{"v":0,"d":"0.0"},{"v":0,"d":"0.0"},{"v":0,"d":"0.0"},{"v":0,"d":"0.0"},{"v":0,"d":"0.0"}]
[{"$nulls":38},"ME MJ /kg TM",{"$f":"IF(AN$26=0,0,AN44/AN$26)","v":{"v":0,"d":"0.00"}},{"v":0,"d":"0.00"},{"v":0,"d":"0.00"},{"v":0,"d":"0.00"},{"v":0,"d":"0.00"},{"v":0,"d":"0.00"},{"v":0,"d":"0.00"},{"v":0,"d":"0.00"},{"v":0,"d":"0.00"},"Na, g/kg TM",{"v":0,"d":"0.0"},{"v":0,"d":"0.0"},{"v":0,"d":"0.0"},{"v":0,"d":"0.0"},{"v":0,"d":"0.0"},{"v":0,"d":"0.0"},{"v":0,"d":"0.0"},{"v":0,"d":"0.0"},{"v":0,"d":"0.0"}]
[{"$nulls":38},"nXP, g/kg TM",{"$f":"IF(AN$26=0,0,AN48/AN$26)","v":0},0,0,0,0,0,0,0,0,"Mg, g/kg TM",{"v":0,"d":"0.0"},{"v":0,"d":"0.0"},{"v":0,"d":"0.0"},{"v":0,"d":"0.0"},{"v":0,"d":"0.0"},{"v":0,"d":"0.0"},{"v":0,"d":"0.0"},{"v":0,"d":"0.0"},{"v":0,"d":"0.0"}]
[{"$nulls":38},"RNB, g/kg TM",{"$f":"IF(AN$26=0,0,AN49/AN$26)","v":{"v":0,"d":"0.00"}},{"v":0,"d":"0.00"},{"v":0,"d":"0.00"},{"v":0,"d":"0.00"},{"v":0,"d":"0.00"},{"v":0,"d":"0.00"},{"v":0,"d":"0.00"},{"v":0,"d":"0.00"},{"v":0,"d":"0.00"},"K, g/kg TM",{"v":0,"d":"0.0"},{"v":0,"d":"0.0"},{"v":0,"d":"0.0"},{"v":0,"d":"0.0"},{"v":0,"d":"0.0"},{"v":0,"d":"0.0"},{"v":0,"d":"0.0"},{"v":0,"d":"0.0"},{"v":0,"d":"0.0"}]
[{"$nulls":38},"UDP, %",{"$f":"IF(AN$26=0,0,AN50/AN$26)","v":0},0,0,0,0,0,0,0,0,"Se, mg/kg TM",{"$f":"IF(AN$26=0,0,AN67/AN$26)","v":{"v":0,"d":"0.0"}},{"$f":"IF(AO$26=0,0,AO67/AO$26)","v":{"v":0,"d":"0.0"}},{"v":0,"d":"0.0"},{"v":0,"d":"0.0"},{"v":0,"d":"0.0"},{"v":0,"d":"0.0"},{"v":0,"d":"0.0"},{"v":0,"d":"0.0"},{"v":0,"d":"0.0"}]
[{"$nulls":38},"ADF, g/kg TM",{"$f":"IF(AN$26=0,0,AN52/AN$26)","v":0},0,0,0,0,0,0,0,0,{"$f":"AM68","v":"DCAB, meq"},{"$f":"IF(AN$26=0,0,AN68/AN$26)","v":{"v":0,"d":"0.0"}},{"$f":"IF(AO$26=0,0,AO68/AO$26)","v":{"v":0,"d":"0.0"}},{"v":0,"d":"0.0"},{"v":0,"d":"0.0"},{"v":0,"d":"0.0"},{"v":0,"d":"0.0"},{"v":0,"d":"0.0"},{"v":0,"d":"0.0"},{"v":0,"d":"0.0"}]
[{"$nulls":38},"NDF, g/kg TM",{"$f":"IF(AN$26=0,0,AN53/AN$26)","v":0},0,0,0,0,0,0,0,0,"Kosten €/Tier",{"$f":"IF(AN$26=0,0,AN69)","v":{"v":0,"d":"0.00"}},{"$f":"IF(AO$26=0,0,AO69)","v":{"v":0,"d":"0.00"}},{"v":0,"d":"0.00"},{"v":0,"d":"0.00"},{"v":0,"d":"0.00"},{"v":0,"d":"0.00"},{"v":0,"d":"0.00"},{"v":0,"d":"0.00"},{"v":0,"d":"0.00"}]
[{"$nulls":38},"SW",{"$f":"IF(AN$26=0,0,AN51/AN$26)","v":{"v":0,"d":"0.00"}},{"v":0,"d":"0.00"},{"v":0,"d":"0.00"},{"v":0,"d":"0.00"},{"v":0,"d":"0.00"},{"v":0,"d":"0.00"},{"v":0,"d":"0.00"},{"v":0,"d":"0.00"},{"v":0,"d":"0.00"},"Kosten ct/kg MEW",{"$f":"IF(AN28=\"-\",\"-\",AX36/AN28*100)","v":"-"},"-","-","-","-","-","-","-","-"]
[{"$nulls":38},"peNDF, g/kg"]
[{"$nulls":38},"peNDF, g/kg",{"$nulls":9},"Bemerkungen:"]
[{"$nulls":38},"peNDF, g/kg"]
[{"$nulls":38},{"$f":"Eigenmischungen!A52","v":"UniRat 2022, © W. Sekul, LAZBW Aulendorf             Die Daten sind auf Plausibilität zu prüfen, um Eingabe- und Berechnungsfehler auszuschließen. Es wird keine Gewähr zur Richtigkeit der Daten übernommen."},{"$nulls":15},{"$f":"Einstellungen!C1","v":"Bearbeiter*in:"},null,{"$f":"Einstellungen!E1","v":"E. Gerster"}]
[{"$nulls":38},{"$f":"D2&\", %\"","v":"TS, %"},{"$f":"IF(AN26=0,0,AN26/AN25)","v":{"v":0,"d":"0.0%"}},{"v":0,"d":"0.0%"},{"v":0,"d":"0.0%"},{"v":0,"d":"0.0%"},{"v":0,"d":"0.0%"},{"v":0,"d":"0.0%"},{"v":0,"d":"0.0%"},{"v":0,"d":"0.0%"},{"v":0,"d":"0.0%"}]
[{"$nulls":38},{"$f":"E2&\", MJ\"","v":"NEL, MJ"},{"$f":"(AN$4*$E$4*$D$4+AN$5*$E$5*$D$5+AN$6*$E$6*$D$6+AN$7*$E$7*$D$7+AN$8*$E$8*$D$8+AN$9*$E$9*$D$9+AN$10*$E$10*$D$10+AN$11*$E$11*$D$11+AN$12*$E$12*$D$12+AN$13*$E$13*$D$13+AN$14*$E$14*$D$14+AN$15*$E$15*$D$15+AN$16*$E$16*$D$16+AN$17*$E$17*$D$17+AN$18*$E$18*$D$18+AN$19*$E$19*$D$19+AN$20*$E$20*$D$20+AN$21*$E$21*$D$21+AN$22*$E$22*$D$22+AN$23*$E$23*$D$23+AN$24*$E$24*$D$24)/100","v":{"v":0,"d":"0.0"}},{"$f":"(AO$4*$E$4*$D$4+AO$5*$E$5*$D$5+AO$6*$E$6*$D$6+AO$7*$E$7*$D$7+AO$8*$E$8*$D$8+AO$9*$E$9*$D$9+AO$10*$E$10*$D$10+AO$11*$E$11*$D$11+AO$12*$E$12*$D$12+AO$13*$E$13*$D$13+AO$14*$E$14*$D$14+AO$15*$E$15*$D$15+AO$16*$E$16*$D$16+AO$17*$E$17*$D$17+AO$18*$E$18*$D$18+AO$19*$E$19*$D$19+AO$20*$E$20*$D$20+AO$21*$E$21*$D$21+AO$22*$E$22*$D$22+AO$23*$E$23*$D$23+AO$24*$E$24*$D$24)/100","v":{"v":0,"d":"0.0"}},{"$f":"(AP$4*$E$4*$D$4+AP$5*$E$5*$D$5+AP$6*$E$6*$D$6+AP$7*$E$7*$D$7+AP$8*$E$8*$D$8+AP$9*$E$9*$D$9+AP$10*$E$10*$D$10+AP$11*$E$11*$D$11+AP$12*$E$12*$D$12+AP$13*$E$13*$D$13+AP$14*$E$14*$D$14+AP$15*$E$15*$D$15+AP$16*$E$16*$D$16+AP$17*$E$17*$D$17+AP$18*$E$18*$D$18+AP$19*$E$19*$D$19+AP$20*$E$20*$D$20+AP$21*$E$21*$D$21+AP$22*$E$22*$D$22+AP$23*$E$23*$D$23+AP$24*$E$24*$D$24)/100","v":{"v":0,"d":"0.0"}},{"v":0,"d":"0.0"},{"v":0,"d":"0.0"},{"v":0,"d":"0.0"},{"v":0,"d":"0.0"},{"v":0,"d":"0.0"},{"v":0,"d":"0.0"}]
[{"$nulls":38},{"$f":"F2&\", MJ\"","v":"ME, MJ"},{"$f":"(AN$4*$F$4*$D$4+AN$5*$F$5*$D$5+AN$6*$F$6*$D$6+AN$7*$F$7*$D$7+AN$8*$F$8*$D$8+AN$9*$F$9*$D$9+AN$10*$F$10*$D$10+AN$11*$F$11*$D$11+AN$12*$F$12*$D$12+AN$13*$F$13*$D$13+AN$14*$F$14*$D$14+AN$15*$F$15*$D$15+AN$16*$F$16*$D$16+AN$17*$F$17*$D$17+AN$18*$F$18*$D$18+AN$19*$F$19*$D$19+AN$20*$F$20*$D$20+AN$21*$F$21*$D$21+AN$22*$F$22*$D$22+AN$23*$F$23*$D$23+AN$24*$F$24*$D$24)/100","v":{"v":0,"d":"0.0"}},{"$f":"(AO$4*$F$4*$D$4+AO$5*$F$5*$D$5+AO$6*$F$6*$D$6+AO$7*$F$7*$D$7+AO$8*$F$8*$D$8+AO$9*$F$9*$D$9+AO$10*$F$10*$D$10+AO$11*$F$11*$D$11+AO$12*$F$12*$D$12+AO$13*$F$13*$D$13+AO$14*$F$14*$D$14+AO$15*$F$15*$D$15+AO$16*$F$16*$D$16+AO$17*$F$17*$D$17+AO$18*$F$18*$D$18+AO$19*$F$19*$D$19+AO$20*$F$20*$D$20+AO$21*$F$21*$D$21+AO$22*$F$22*$D$22+AO$23*$F$23*$D$23+AO$24*$F$24*$D$24)/100","v":{"v":0,"d":"0.0"}},{"$f":"(AP$4*$F$4*$D$4+AP$5*$F$5*$D$5+AP$6*$F$6*$D$6+AP$7*$F$7*$D$7+AP$8*$F$8*$D$8+AP$9*$F$9*$D$9+AP$10*$F$10*$D$10+AP$11*$F$11*$D$11+AP$12*$F$12*$D$12+AP$13*$F$13*$D$13+AP$14*$F$14*$D$14+AP$15*$F$15*$D$15+AP$16*$F$16*$D$16+AP$17*$F$17*$D$17+AP$18*$F$18*$D$18+AP$19*$F$19*$D$19+AP$20*$F$20*$D$20+AP$21*$F$21*$D$21+AP$22*$F$22*$D$22+AP$23*$F$23*$D$23+AP$24*$F$24*$D$24)/100","v":{"v":0,"d":"0.0"}},{"v":0,"d":"0.0"},{"v":0,"d":"0.0"},{"v":0,"d":"0.0"},{"v":0,"d":"0.0"},{"v":0,"d":"0.0"},{"v":0,"d":"0.0"}]
[{"$nulls":38},{"$f":"G2&\", g\"","v":"XP, g"},{"$f":"(AN$4*$G$4*$D$4+AN$5*$G$5*$D$5+AN$6*$G$6*$D$6+AN$7*$G$7*$D$7+AN$8*$G$8*$D$8+AN$9*$G$9*$D$9+AN$10*$G$10*$D$10+AN$11*$G$11*$D$11+AN$12*$G$12*$D$12+AN$13*$G$13*$D$13+AN$14*$G$14*$D$14+AN$15*$G$15*$D$15+AN$16*$G$16*$D$16+AN$17*$G$17*$D$17+AN$18*$G$18*$D$18+AN$19*$G$19*$D$19+AN$20*$G$20*$D$20+AN$21*$G$21*$D$21+AN$22*$G$22*$D$22+AN$23*$G$23*$D$23+AN$24*$G$24*$D$24)/100","v":0},{"$f":"(AO$4*$G$4*$D$4+AO$5*$G$5*$D$5+AO$6*$G$6*$D$6+AO$7*$G$7*$D$7+AO$8*$G$8*$D$8+AO$9*$G$9*$D$9+AO$10*$G$10*$D$10+AO$11*$G$11*$D$11+AO$12*$G$12*$D$12+AO$13*$G$13*$D$13+AO$14*$G$14*$D$14+AO$15*$G$15*$D$15+AO$16*$G$16*$D$16+AO$17*$G$17*$D$17+AO$18*$G$18*$D$18+AO$19*$G$19*$D$19+AO$20*$G$20*$D$20+AO$21*$G$21*$D$21+AO$22*$G$22*$D$22+AO$23*$G$23*$D$23+AO$24*$G$24*$D$24)/100","v":0},{"$f":"(AP$4*$G$4*$D$4+AP$5*$G$5*$D$5+AP$6*$G$6*$D$6+AP$7*$G$7*$D$7+AP$8*$G$8*$D$8+AP$9*$G$9*$D$9+AP$10*$G$10*$D$10+AP$11*$G$11*$D$11+AP$12*$G$12*$D$12+AP$13*$G$13*$D$13+AP$14*$G$14*$D$14+AP$15*$G$15*$D$15+AP$16*$G$16*$D$16+AP$17*$G$17*$D$17+AP$18*$G$18*$D$18+AP$19*$G$19*$D$19+AP$20*$G$20*$D$20+AP$21*$G$21*$D$21+AP$22*$G$22*$D$22+AP$23*$G$23*$D$23+AP$24*$G$24*$D$24)/100","v":0},0,0,0,0,0,0]
[{"$nulls":38},{"$f":"G2&\"g/kg TM\"","v":"XPg/kg TM"},{"$f":"IF(AN26=0,0,AN45/AN26)","v":0},0,0,0,0,0,0,0,0]
[{"$nulls":38},{"$f":"H2","v":"UDP"},{"$f":"IF(AN26=0,0,(AN$4*$H$4*$D$4+AN$5*$H$5*$D$5+AN$6*$H$6*$D$6+AN$7*$H$7*$D$7+AN$8*$H$8*$D$8+AN$9*$H$9*$D$9+AN$10*$H$10*$D$10+AN$11*$H$11*$D$11+AN$12*$H$12*$D$12+AN$13*$H$13*$D$13+AN$14*$H$14*$D$14+AN$15*$H$15*$D$15+AN$16*$H$16*$D$16+AN$17*$H$17*$D$17+AN$18*$H$18*$D$18+AN$19*$H$19*$D$19+AN$20*$H$20*$D$20+AN$21*$H$21*$D$21+AN$22*$H$22*$D$22+AN$23*$H$23*$D$23+AN$24*$H$24*$D$24)/100/AN26)","v":{"v":0,"d":"0%"}},{"v":0,"d":"0%"},{"v":0,"d":"0%"},{"v":0,"d":"0%"},{"v":0,"d":"0%"},{"v":0,"d":"0%"},{"v":0,"d":"0%"},{"v":0,"d":"0%"},{"v":0,"d":"0%"}]
[{"$nulls":38},{"$f":"I2&\", g\"","v":"nXP, g"},{"$f":"(AN$4*$I$4*$D$4+AN$5*$I$5*$D$5+AN$6*$I$6*$D$6+AN$7*$I$7*$D$7+AN$8*$I$8*$D$8+AN$9*$I$9*$D$9+AN$10*$I$10*$D$10+AN$11*$I$11*$D$11+AN$12*$I$12*$D$12+AN$13*$I$13*$D$13+AN$14*$I$14*$D$14+AN$15*$I$15*$D$15+AN$16*$I$16*$D$16+AN$17*$I$17*$D$17+AN$18*$I$18*$D$18+AN$19*$I$19*$D$19+AN$20*$I$20*$D$20+AN$21*$I$21*$D$21+AN$22*$I$22*$D$22+AN$23*$I$23*$D$23+AN$24*$I$24*$D$24)/100","v":0},{"$f":"(AO$4*$I$4*$D$4+AO$5*$I$5*$D$5+AO$6*$I$6*$D$6+AO$7*$I$7*$D$7+AO$8*$I$8*$D$8+AO$9*$I$9*$D$9+AO$10*$I$10*$D$10+AO$11*$I$11*$D$11+AO$12*$I$12*$D$12+AO$13*$I$13*$D$13+AO$14*$I$14*$D$14+AO$15*$I$15*$D$15+AO$16*$I$16*$D$16+AO$17*$I$17*$D$17+AO$18*$I$18*$D$18+AO$19*$I$19*$D$19+AO$20*$I$20*$D$20+AO$21*$I$21*$D$21+AO$22*$I$22*$D$22+AO$23*$I$23*$D$23+AO$24*$I$24*$D$24)/100","v":0},{"$f":"(AP$4*$I$4*$D$4+AP$5*$I$5*$D$5+AP$6*$I$6*$D$6+AP$7*$I$7*$D$7+AP$8*$I$8*$D$8+AP$9*$I$9*$D$9+AP$10*$I$10*$D$10+AP$11*$I$11*$D$11+AP$12*$I$12*$D$12+AP$13*$I$13*$D$13+AP$14*$I$14*$D$14+AP$15*$I$15*$D$15+AP$16*$I$16*$D$16+AP$17*$I$17*$D$17+AP$18*$I$18*$D$18+AP$19*$I$19*$D$19+AP$20*$I$20*$D$20+AP$21*$I$21*$D$21+AP$22*$I$22*$D$22+AP$23*$I$23*$D$23+AP$24*$I$24*$D$24)/100","v":0},0,0,0,0,0,0]
[{"$nulls":38},{"$f":"J2","v":"RNB"},{"$f":"(AN$4*$J$4*$D$4+AN$5*$J$5*$D$5+AN$6*$J$6*$D$6+AN$7*$J$7*$D$7+AN$8*$J$8*$D$8+AN$9*$J$9*$D$9+AN$10*$J$10*$D$10+AN$11*$J$11*$D$11+AN$12*$J$12*$D$12+AN$13*$J$13*$D$13+AN$14*$J$14*$D$14+AN$15*$J$15*$D$15+AN$16*$J$16*$D$16+AN$17*$J$17*$D$17+AN$18*$J$18*$D$18+AN$19*$J$19*$D$19+AN$20*$J$20*$D$20+AN$21*$J$21*$D$21+AN$22*$J$22*$D$22+AN$23*$J$23*$D$23+AN$24*$J$24*$D$24)/100","v":{"v":0,"d":"0.0"}},{"$f":"(AO$4*$J$4*$D$4+AO$5*$J$5*$D$5+AO$6*$J$6*$D$6+AO$7*$J$7*$D$7+AO$8*$J$8*$D$8+AO$9*$J$9*$D$9+AO$10*$J$10*$D$10+AO$11*$J$11*$D$11+AO$12*$J$12*$D$12+AO$13*$J$13*$D$13+AO$14*$J$14*$D$14+AO$15*$J$15*$D$15+AO$16*$J$16*$D$16+AO$17*$J$17*$D$17+AO$18*$J$18*$D$18+AO$19*$J$19*$D$19+AO$20*$J$20*$D$20+AO$21*$J$21*$D$21+AO$22*$J$22*$D$22+AO$23*$J$23*$D$23+AO$24*$J$24*$D$24)/100","v":{"v":0,"d":"0.0"}},{"$f":"(AP$4*$J$4*$D$4+AP$5*$J$5*$D$5+AP$6*$J$6*$D$6+AP$7*$J$7*$D$7+AP$8*$J$8*$D$8+AP$9*$J$9*$D$9+AP$10*$J$10*$D$10+AP$11*$J$11*$D$11+AP$12*$J$12*$D$12+AP$13*$J$13*$D$13+AP$14*$J$14*$D$14+AP$15*$J$15*$D$15+AP$16*$J$16*$D$16+AP$17*$J$17*$D$17+AP$18*$J$18*$D$18+AP$19*$J$19*$D$19+AP$20*$J$20*$D$20+AP$21*$J$21*$D$21+AP$22*$J$22*$D$22+AP$23*$J$23*$D$23+AP$24*$J$24*$D$24)/100","v":{"v":0,"d":"0.0"}},{"v":0,"d":"0.0"},{"v":0,"d":"0.0"},{"v":0,"d":"0.0"},{"v":0,"d":"0.0"},{"v":0,"d":"0.0"},{"v":0,"d":"0.0"}]
[{"$nulls":38},{"$f":"K2","v":"UDP"},{"$f":"(AN$4*$K$4*$D$4+AN$5*$K$5*$D$5+AN$6*$K$6*$D$6+AN$7*$K$7*$D$7+AN$8*$K$8*$D$8+AN$9*$K$9*$D$9+AN$10*$K$10*$D$10+AN$11*$K$11*$D$11+AN$12*$K$12*$D$12+AN$13*$K$13*$D$13+AN$14*$K$14*$D$14+AN$15*$K$15*$D$15+AN$16*$K$16*$D$16+AN$17*$K$17*$D$17+AN$18*$K$18*$D$18+AN$19*$K$19*$D$19+AN$20*$K$20*$D$20+AN$21*$K$21*$D$21+AN$22*$K$22*$D$22+AN$23*$K$23*$D$23+AN$24*$K$24*$D$24)","v":{"v":0,"d":"0.0"}},{"v":0,"d":"0.0"},{"v":0,"d":"0.0"},{"v":0,"d":"0.0"},{"v":0,"d":"0.0"},{"v":0,"d":"0.0"},{"v":0,"d":"0.0"},{"v":0,"d":"0.0"},{"v":0,"d":"0.0"}]
[{"$nulls":38},{"$f":"L2","v":"SW"},{"$f":"(AN$4*$L$4*$D$4+AN$5*$L$5*$D$5+AN$6*$L$6*$D$6+AN$7*$L$7*$D$7+AN$8*$L$8*$D$8+AN$9*$L$9*$D$9+AN$10*$L$10*$D$10+AN$11*$L$11*$D$11+AN$12*$L$12*$D$12+AN$13*$L$13*$D$13+AN$14*$L$14*$D$14+AN$15*$L$15*$D$15+AN$16*$L$16*$D$16+AN$17*$L$17*$D$17+AN$18*$L$18*$D$18+AN$19*$L$19*$D$19+AN$20*$L$20*$D$20+AN$21*$L$21*$D$21+AN$22*$L$22*$D$22+AN$23*$L$23*$D$23+AN$24*$L$24*$D$24)/100","v":{"v":0,"d":"0.0"}},{"v":0,"d":"0.0"},{"v":0,"d":"0.0"},{"v":0,"d":"0.0"},{"v":0,"d":"0.0"},{"v":0,"d":"0.0"},{"v":0,"d":"0.0"},{"v":0,"d":"0.0"},{"v":0,"d":"0.0"}]
[{"$nulls":38},{"$f":"M2&\", g\"","v":"ADF, g"},{"$f":"(AN$4*$M$4*$D$4+AN$5*$M$5*$D$5+AN$6*$M$6*$D$6+AN$7*$M$7*$D$7+AN$8*$M$8*$D$8+AN$9*$M$9*$D$9+AN$10*$M$10*$D$10+AN$11*$M$11*$D$11+AN$12*$M$12*$D$12+AN$13*$M$13*$D$13+AN$14*$M$14*$D$14+AN$15*$M$15*$D$15+AN$16*$M$16*$D$16+AN$17*$M$17*$D$17+AN$18*$M$18*$D$18+AN$19*$M$19*$D$19+AN$20*$M$20*$D$20+AN$21*$M$21*$D$21+AN$22*$M$22*$D$22+AN$23*$M$23*$D$23+AN$24*$M$24*$D$24)/100","v":0},0,0,0,0,0,0,0,0]
[{"$nulls":38},{"$f":"N2&\", g\"","v":"NDF, g"},{"$f":"(AN$4*$N$4*$D$4+AN$5*$N$5*$D$5+AN$6*$N$6*$D$6+AN$7*$N$7*$D$7+AN$8*$N$8*$D$8+AN$9*$N$9*$D$9+AN$10*$N$10*$D$10+AN$11*$N$11*$D$11+AN$12*$N$12*$D$12+AN$13*$N$13*$D$13+AN$14*$N$14*$D$14+AN$15*$N$15*$D$15+AN$16*$N$16*$D$16+AN$17*$N$17*$D$17+AN$18*$N$18*$D$18+AN$19*$N$19*$D$19+AN$20*$N$20*$D$20+AN$21*$N$21*$D$21+AN$22*$N$22*$D$22+AN$23*$N$23*$D$23+AN$24*$N$24*$D$24)/100","v":0},0,0,0,0,0,0,0,0]
[{"$nulls":38},{"$f":"O2&\", g\"","v":"NFC, g"},{"$f":"(AN$4*$O$4*$D$4+AN$5*$O$5*$D$5+AN$6*$O$6*$D$6+AN$7*$O$7*$D$7+AN$8*$O$8*$D$8+AN$9*$O$9*$D$9+AN$10*$O$10*$D$10+AN$11*$O$11*$D$11+AN$12*$O$12*$D$12+AN$13*$O$13*$D$13+AN$14*$O$14*$D$14+AN$15*$O$15*$D$15+AN$16*$O$16*$D$16+AN$17*$O$17*$D$17+AN$18*$O$18*$D$18+AN$19*$O$19*$D$19+AN$20*$O$20*$D$20+AN$21*$O$21*$D$21+AN$22*$O$22*$D$22+AN$23*$O$23*$D$23+AN$24*$O$24*$D$24)/100","v":0},0,0,0,0,0,0,0,0]
[{"$nulls":38},{"$f":"P2&\", g\"","v":"XZ, g"},{"$f":"(AN$4*$P$4*$D$4+AN$5*$P$5*$D$5+AN$6*$P$6*$D$6+AN$7*$P$7*$D$7+AN$8*$P$8*$D$8+AN$9*$P$9*$D$9+AN$10*$P$10*$D$10+AN$11*$P$11*$D$11+AN$12*$P$12*$D$12+AN$13*$P$13*$D$13+AN$14*$P$14*$D$14+AN$15*$P$15*$D$15+AN$16*$P$16*$D$16+AN$17*$P$17*$D$17+AN$18*$P$18*$D$18+AN$19*$P$19*$D$19+AN$20*$P$20*$D$20+AN$21*$P$21*$D$21+AN$22*$P$22*$D$22+AN$23*$P$23*$D$23+AN$24*$P$24*$D$24)/100","v":0},0,0,0,0,0,0,0,0]
[{"$nulls":38},{"$f":"Q2&\", g\"","v":"XL, g"},{"$f":"(AN$4*$Q$4*$D$4+AN$5*$Q$5*$D$5+AN$6*$Q$6*$D$6+AN$7*$Q$7*$D$7+AN$8*$Q$8*$D$8+AN$9*$Q$9*$D$9+AN$10*$Q$10*$D$10+AN$11*$Q$11*$D$11+AN$12*$Q$12*$D$12+AN$13*$Q$13*$D$13+AN$14*$Q$14*$D$14+AN$15*$Q$15*$D$15+AN$16*$Q$16*$D$16+AN$17*$Q$17*$D$17+AN$18*$Q$18*$D$18+AN$19*$Q$19*$D$19+AN$20*$Q$20*$D$20+AN$21*$Q$21*$D$21+AN$22*$Q$22*$D$22+AN$23*$Q$23*$D$23+AN$24*$Q$24*$D$24)/100","v":0},0,0,0,0,0,0,0,0]
[{"$nulls":38},{"$f":"R2&\", g\"","v":"XF, g"},{"$f":"(AN$4*$R$4*$D$4+AN$5*$R$5*$D$5+AN$6*$R$6*$D$6+AN$7*$R$7*$D$7+AN$8*$R$8*$D$8+AN$9*$R$9*$D$9+AN$10*$R$10*$D$10+AN$11*$R$11*$D$11+AN$12*$R$12*$D$12+AN$13*$R$13*$D$13+AN$14*$R$14*$D$14+AN$15*$R$15*$D$15+AN$16*$R$16*$D$16+AN$17*$R$17*$D$17+AN$18*$R$18*$D$18+AN$19*$R$19*$D$19+AN$20*$R$20*$D$20+AN$21*$R$21*$D$21+AN$22*$R$22*$D$22+AN$23*$R$23*$D$23+AN$24*$R$24*$D$24)/100","v":0},0,0,0,0,0,0,0,0]
[{"$nulls":38},{"$f":"R2&\", g\"","v":"XF, g"},{"$f":"IF(AN26=0,0,AN57/AN26)","v":0},0,0,0,0,0,0,0,0]
[{"$nulls":38},{"$f":"S2&\"g/kg TM\"","v":"sXFg/kg TM"},{"$f":"(AN$4*$S$4*$D$4+AN$5*$S$5*$D$5+AN$6*$S$6*$D$6+AN$7*$S$7*$D$7+AN$8*$S$8*$D$8+AN$9*$S$9*$D$9+AN$10*$S$10*$D$10+AN$11*$S$11*$D$11+AN$12*$S$12*$D$12+AN$13*$S$13*$D$13+AN$14*$S$14*$D$14+AN$15*$S$15*$D$15+AN$16*$S$16*$D$16+AN$17*$S$17*$D$17+AN$18*$S$18*$D$18+AN$19*$S$19*$D$19+AN$20*$S$20*$D$20+AN$21*$S$21*$D$21+AN$22*$S$22*$D$22+AN$23*$S$23*$D$23+AN$24*$S$24*$D$24)/100","v":0},0,0,0,0,0,0,0,0]
[{"$nulls":38},{"$f":"T2&\", g \"","v":"XA, g "},{"$f":"IF(AN26=0,0,AN61/AN26)","v":0},0,0,0,0,0,0,0,0]
[{"$nulls":38},{"$f":"T2&\", g\"","v":"XA, g"},{"$f":"(AN$4*$T$4*$D$4+AN$5*$T$5*$D$5+AN$6*$T$6*$D$6+AN$7*$T$7*$D$7+AN$8*$T$8*$D$8+AN$9*$T$9*$D$9+AN$10*$T$10*$D$10+AN$11*$T$11*$D$11+AN$12*$T$12*$D$12+AN$13*$T$13*$D$13+AN$14*$T$14*$D$14+AN$15*$T$15*$D$15+AN$16*$T$16*$D$16+AN$17*$T$17*$D$17+AN$18*$T$18*$D$18+AN$19*$T$19*$D$19+AN$20*$T$20*$D$20+AN$21*$T$21*$D$21+AN$22*$T$22*$D$22+AN$23*$T$23*$D$23+AN$24*$T$24*$D$24)/100","v":0},0,0,0,0,0,0,0,0]
[{"$nulls":38},{"$f":"U2&\", g\"","v":"Ca, g"},{"$f":"(AN$4*$U$4*$D$4+AN$5*$U$5*$D$5+AN$6*$U$6*$D$6+AN$7*$U$7*$D$7+AN$8*$U$8*$D$8+AN$9*$U$9*$D$9+AN$10*$U$10*$D$10+AN$11*$U$11*$D$11+AN$12*$U$12*$D$12+AN$13*$U$13*$D$13+AN$14*$U$14*$D$14+AN$15*$U$15*$D$15+AN$16*$U$16*$D$16+AN$17*$U$17*$D$17+AN$18*$U$18*$D$18+AN$19*$U$19*$D$19+AN$20*$U$20*$D$20+AN$21*$U$21*$D$21+AN$22*$U$22*$D$22+AN$23*$U$23*$D$23+AN$24*$U$24*$D$24)/100","v":0},0,0,0,0,0,0,0,0]
[{"$nulls":38},{"$f":"V2&\", g\"","v":"P, g"},{"$f":"(AN$4*$V$4*$D$4+AN$5*$V$5*$D$5+AN$6*$V$6*$D$6+AN$7*$V$7*$D$7+AN$8*$V$8*$D$8+AN$9*$V$9*$D$9+AN$10*$V$10*$D$10+AN$11*$V$11*$D$11+AN$12*$V$12*$D$12+AN$13*$V$13*$D$13+AN$14*$V$14*$D$14+AN$15*$V$15*$D$15+AN$16*$V$16*$D$16+AN$17*$V$17*$D$17+AN$18*$V$18*$D$18+AN$19*$V$19*$D$19+AN$20*$V$20*$D$20+AN$21*$V$21*$D$21+AN$22*$V$22*$D$22+AN$23*$V$23*$D$23+AN$24*$V$24*$D$24)/100","v":0},0,0,0,0,0,0,0,0]
[{"$nulls":38},{"$f":"W2&\", g\"","v":"Na, g"},{"$f":"(AN$4*$W$4*$D$4+AN$5*$W$5*$D$5+AN$6*$W$6*$D$6+AN$7*$W$7*$D$7+AN$8*$W$8*$D$8+AN$9*$W$9*$D$9+AN$10*$W$10*$D$10+AN$11*$W$11*$D$11+AN$12*$W$12*$D$12+AN$13*$W$13*$D$13+AN$14*$W$14*$D$14+AN$15*$W$15*$D$15+AN$16*$W$16*$D$16+AN$17*$W$17*$D$17+AN$18*$W$18*$D$18+AN$19*$W$19*$D$19+AN$20*$W$20*$D$20+AN$21*$W$21*$D$21+AN$22*$W$22*$D$22+AN$23*$W$23*$D$23+AN$24*$W$24*$D$24)/100","v":{"v":0,"d":"0.0"}},{"v":0,"d":"0.0"},{"v":0,"d":"0.0"},{"v":0,"d":"0.0"},{"v":0,"d":"0.0"},{"v":0,"d":"0.0"},{"v":0,"d":"0.0"},{"v":0,"d":"0.0"},{"v":0,"d":"0.0"}]
[{"$nulls":38},{"$f":"X2&\", g\"","v":"Mg, g"},{"$f":"(AN$4*$X$4*$D$4+AN$5*$X$5*$D$5+AN$6*$X$6*$D$6+AN$7*$X$7*$D$7+AN$8*$X$8*$D$8+AN$9*$X$9*$D$9+AN$10*$X$10*$D$10+AN$11*$X$11*$D$11+AN$12*$X$12*$D$12+AN$13*$X$13*$D$13+AN$14*$X$14*$D$14+AN$15*$X$15*$D$15+AN$16*$X$16*$D$16+AN$17*$X$17*$D$17+AN$18*$X$18*$D$18+AN$19*$X$19*$D$19+AN$20*$X$20*$D$20+AN$21*$X$21*$D$21+AN$22*$X$22*$D$22+AN$23*$X$23*$D$23+AN$24*$X$24*$D$24)/100","v":{"v":0,"d":"0.0"}},{"v":0,"d":"0.0"},{"v":0,"d":"0.0"},{"v":0,"d":"0.0"},{"v":0,"d":"0.0"},{"v":0,"d":"0.0"},{"v":0,"d":"0.0"},{"v":0,"d":"0.0"},{"v":0,"d":"0.0"}]
[{"$nulls":38},{"$f":"Y2&\", g\"","v":"K, g"},{"$f":"(AN$4*$Y$4*$D$4+AN$5*$Y$5*$D$5+AN$6*$Y$6*$D$6+AN$7*$Y$7*$D$7+AN$8*$Y$8*$D$8+AN$9*$Y$9*$D$9+AN$10*$Y$10*$D$10+AN$11*$Y$11*$D$11+AN$12*$Y$12*$D$12+AN$13*$Y$13*$D$13+AN$14*$Y$14*$D$14+AN$15*$Y$15*$D$15+AN$16*$Y$16*$D$16+AN$17*$Y$17*$D$17+AN$18*$Y$18*$D$18+AN$19*$Y$19*$D$19+AN$20*$Y$20*$D$20+AN$21*$Y$21*$D$21+AN$22*$Y$22*$D$22+AN$23*$Y$23*$D$23+AN$24*$Y$24*$D$24)/100","v":0},0,0,0,0,0,0,0,0]
[{"$nulls":38},{"$f":"Z2&\", g\"","v":"Se, g"},{"$f":"(AN$4*$Z$4*$D$4+AN$5*$Z$5*$D$5+AN$6*$Z$6*$D$6+AN$7*$Z$7*$D$7+AN$8*$Z$8*$D$8+AN$9*$Z$9*$D$9+AN$10*$Z$10*$D$10+AN$11*$Z$11*$D$11+AN$12*$Z$12*$D$12+AN$13*$Z$13*$D$13+AN$14*$Z$14*$D$14+AN$15*$Z$15*$D$15+AN$16*$Z$16*$D$16+AN$17*$Z$17*$D$17+AN$18*$Z$18*$D$18+AN$19*$Z$19*$D$19+AN$20*$Z$20*$D$20+AN$21*$Z$21*$D$21+AN$22*$Z$22*$D$22+AN$23*$Z$23*$D$23+AN$24*$Z$24*$D$24)/100","v":{"v":0,"d":"0.0"}},{"v":0,"d":"0.0"},{"v":0,"d":"0.0"},{"v":0,"d":"0.0"},{"v":0,"d":"0.0"},{"v":0,"d":"0.0"},{"v":0,"d":"0.0"},{"v":0,"d":"0.0"},{"v":0,"d":"0.0"}]
[{"$nulls":38},{"$f":"AA2&\", meq\"","v":"DCAB, meq"},{"$f":"(AN$4*$AA$4*$D$4+AN$5*$AA$5*$D$5+AN$6*$AA$6*$D$6+AN$7*$AA$7*$D$7+AN$8*$AA$8*$D$8+AN$9*$AA$9*$D$9+AN$10*$AA$10*$D$10+AN$11*$AA$11*$D$11+AN$12*$AA$12*$D$12+AN$13*$AA$13*$D$13+AN$14*$AA$14*$D$14+AN$15*$AA$15*$D$15+AN$16*$AA$16*$D$16+AN$17*$AA$17*$D$17+AN$18*$AA$18*$D$18+AN$19*$AA$19*$D$19+AN$20*$AA$20*$D$20+AN$21*$AA$21*$D$21+AN$22*$AA$22*$D$22+AN$23*$AA$23*$D$23+AN$24*$AA$24*$D$24)/100","v":{"v":0,"d":"0.0"}},{"$f":"(AO$4*$AA$4*$D$4+AO$5*$AA$5*$D$5+AO$6*$AA$6*$D$6+AO$7*$AA$7*$D$7+AO$8*$AA$8*$D$8+AO$9*$AA$9*$D$9+AO$10*$AA$10*$D$10+AO$11*$AA$11*$D$11+AO$12*$AA$12*$D$12+AO$13*$AA$13*$D$13+AO$14*$AA$14*$D$14+AO$15*$AA$15*$D$15+AO$16*$AA$16*$D$16+AO$17*$AA$17*$D$17+AO$18*$AA$18*$D$18+AO$19*$AA$19*$D$19+AO$20*$AA$20*$D$20+AO$21*$AA$21*$D$21+AO$22*$AA$22*$D$22+AO$23*$AA$23*$D$23+AO$24*$AA$24*$D$24)/100","v":{"v":0,"d":"0.0"}},{"v":0,"d":"0.0"},{"v":0,"d":"0.0"},{"v":0,"d":"0.0"},{"v":0,"d":"0.0"},{"v":0,"d":"0.0"},{"v":0,"d":"0.0"},{"v":0,"d":"0.0"}]
[{"$nulls":38},{"$f":"AB2&\", €/kg TM\"","v":"Kosten, €/kg TM"},{"$f":"(AN$4*$AB$4*$D$4+AN$5*$AB$5*$D$5+AN$6*$AB$6*$D$6+AN$7*$AB$7*$D$7+AN$8*$AB$8*$D$8+AN$9*$AB$9*$D$9+AN$10*$AB$10*$D$10+AN$11*$AB$11*$D$11+AN$12*$AB$12*$D$12+AN$13*$AB$13*$D$13+AN$14*$AB$14*$D$14+AN$15*$AB$15*$D$15+AN$16*$AB$16*$D$16+AN$17*$AB$17*$D$17+AN$18*$AB$18*$D$18+AN$19*$AB$19*$D$19+AN$20*$AB$20*$D$20+AN$21*$AB$21*$D$21+AN$22*$AB$22*$D$22+AN$23*$AB$23*$D$23+AN$24*$AB$24*$D$24)/100","v":{"$error":"#DIV/0!"}},{"$error":"#DIV/0!"},{"$error":"#DIV/0!"},{"$error":"#DIV/0!"},{"$error":"#DIV/0!"},{"$error":"#DIV/0!"},{"$error":"#DIV/0!"},{"$error":"#DIV/0!"},{"$error":"#DIV/0!"}]
[]
[]
[]
[2]
[3]

{"sheet":"Ration Aufzucht-Mast","index":9,"n_rows":100,"n_cols":78,"rows_kept":100,"merged":[[23,17,23,19]]}
[{"$f":"IF(G4=1, \"Rationsberechnung für die Bullenmast\",\"Rationsberechnung für die Rinderaufzucht\")","v":"Rationsberechnung für die Rinderaufzucht"}]
[]
[null,"Dateneingabe",{"$nulls":4},1,"Bullenmast",{"$nulls":3},"Holstein Frisian",{"$nulls":5},"Lebendmasse",null,null,{"v":350,"d":"350 kg"},{"$nulls":16},"f(x)=a*epx(b*LM)"]
[null,1,null,"Trockenmasse",null,null,2,{"$nulls":3},3,"Fleckvieh",{"$nulls":5},"TagesZunahme (LMZ)",null,null,{"v":800,"d":"800 g"},{"$nulls":15},"a",6.5878,9.0924,11.7454,13.8731,16.5801]
[{"$nulls":3},"Frischmasse",{"$nulls":3},"Rinderaufzucht",{"$nulls":3},"Färsen",{"$nulls":5},"Futteraufnahme",null,null,{"$f":"V5/100","v":{"v":1,"d":"100%"}},100,{"$nulls":14},"b",0.002125,0.002301,0.002485,{"v":0.00276,"d":"0.002760"},{"v":2.911E-3,"d":"0.002911"}]
[{"$nulls":34},"Tabellen","Sbt","Ansatz",{"$f":"AL4*EXP(AL5*$U$3)","v":13.859479703505173},{"$f":"AM4*EXP(AM5*$U$3)","v":20.344058420389768},{"$f":"AN4*EXP(AN5*$U$3)","v":28.028214809327},{"$f":"AO4*EXP(AO5*$U$3)","v":36.4503737917158},{"$f":"AP4*EXP(AP5*$U$3)","v":45.927000075044475},{"$nulls":23},"IT",{"$nulls":6},"MJNEL"]
[null,"Ration 1",{"$nulls":5},"Gehalt je kg TM im Futter",{"$nulls":11},"Gehalt der Ration",{"$nulls":14},"LM","Erhaltung",null,600,800,1000,1200,1400,1600,{"$nulls":3},{"$f":"AL7","v":600},800,1000,1200,1400,1600,"Mittelwert",{"$nulls":12},{"$f":"AU7","v":600},{"$f":"AV7","v":800},{"$f":"AW7","v":1000},{"$f":"AX7","v":1200},{"$f":"AY7","v":1400},1600,null,null,{"$f":"BN7","v":600},{"$f":"BO7","v":800},{"$f":"BP7","v":1000},{"$f":"BQ7","v":1200},{"$f":"BR7","v":1400}]
[null,{"$f":"IF(Mast_Eingabe=1,\"TM\",IF(Mast_Eingabe=2,\"FM\",\"\"))","v":"TM"},{"$nulls":4},"TS","ME","nXP","RNB","NFC",{"$f":"IF(Art=1,\"SW\",\"\")","v":"SW"},"ADF","NDF","Ca","P","Na","Mg","Kosten","FM","TM",{"$f":"+H8","v":"ME"},"nXP","RNB","NFC","SW","ADF","NDF","Ca","P","Na","Mg","Kosten",null,175,{"$f":"AI8^0.75*0.53","v":{"v":25.500835287658493,"d":"25.5"}},{"$f":"AI8","v":{"v":175,"d":"175.0"}},9.6,13.9,18.9,{"$nulls":6},{"$f":"AL8/AU$7*1000","v":{"v":16,"d":"16.0"}},{"v":17.375,"d":"17.4"},18.9,{"$nulls":3},{"$f":"MEDIAN(AU8:AZ8)","v":{"v":17.375,"d":"17.4"}},{"$nulls":11},{"$f":"AI8","v":175},{"$f":"(-19.7+4.55*LN($BM8)+0.00066*BN$7)*$U$5","v":{"v":4.195776181351991,"d":"4.20"}},{"v":4.327776181351991,"d":"4.33"},{"v":4.459776181351991,"d":"4.46"},{"v":4.591776181351991,"d":"4.59"},{"v":4.723776181351991,"d":"4.72"},{"v":4.855776181351991,"d":"4.86"},null,{"$f":"BM8","v":175},{"$f":"AU8/BN8","v":{"v":3.813358794282581,"d":"3.81"}},{"v":4.0147639970078295,"d":"4.01"},{"v":4.237880833353933,"d":"4.24"}]
[null,"kg",null,"Grobfutter, ad lib Komponenten",null,null,"%","MJ","g",{"$f":"IF(J8=\"\",\"\",\"g\")","v":"g"},"g",null,{"$f":"IF(M8=\"\",\"\",\"g\")","v":"g"},"g","g","g","g","% d. XF","€/kg FM","kg","kg","MJ","g",{"$f":"J9","v":"g"},"g",null,"g","g","g","g","g","g","€",null,225,{"$f":"AI9^0.75*0.53","v":{"v":30.790217602348957,"d":"30.8"}},{"$f":"AI9","v":{"v":225,"d":"225.0"}},10.6,15.2,20.4,26.3,{"$nulls":5},{"v":17.666666666666668,"d":"17.7"},{"v":19,"d":"19.0"},20.4,{"$f":"AO9/AX$7*1000","v":{"v":21.916666666666668,"d":"21.9"}},null,null,{"$f":"MEDIAN(AU9:AZ9)","v":19.7},{"$nulls":11},{"$f":"AI9","v":225},{"v":5.339256830030112,"d":"5.34"},{"v":5.4712568300301125,"d":"5.47"},{"v":5.603256830030112,"d":"5.60"},{"v":5.735256830030112,"d":"5.74"},{"v":5.8672568300301124,"d":"5.87"},{"v":5.999256830030112,"d":"6.00"},null,{"$f":"BM9","v":225},{"v":3.308825034844228,"d":"3.31"},{"v":3.4726938599764887,"d":"3.47"},{"v":3.6407397731027022,"d":"3.64"},{"$f":"AX9/BQ9","v":{"v":3.821392365884964,"d":"3.82"}}]
[null,null,77,{"$f":"INDEX(Tabelle,$C10,1)","v":0},null,{"$f":"IF(INDEX(Tabelle,$C10,22)=\"\",\"\",1)","v":1},{"$f":"IF(INDEX(Tabelle,$C10,2)=\"\",\"fehlt\",INDEX(Tabelle,$C10,2)/10)","v":{"v":1e-05,"d":"0.0"}},{"$f":"IF(INDEX(Tabelle,$C10,4)=\"\",\"fehlt\",INDEX(Tabelle,$C10,4))","v":{"v":1E-4,"d":"0.0"}},{"$f":"IF(INDEX(Tabelle,$C10,7)=\"\",\"fehlt\",INDEX(Tabelle,$C10,7))","v":{"v":1E-4,"d":"0"}},{"$f":"IF(INDEX(Tabelle,$C10,8)=\"\",\"fehlt\",INDEX(Tabelle,$C10,8))","v":{"v":1E-4,"d":"0.0"}},{"$f":"IF(INDEX(Tabelle,$C10,12)=\"\",\"fehlt\",INDEX(Tabelle,$C10,12))","v":{"v":1E-4,"d":"0"}},{"$f":"IF(INDEX(Tabelle,$C10,9)=\"\",\"fehlt\",INDEX(Tabelle,$C10,9))","v":{"v":1E-4,"d":"0.00"}},{"$f":"IF(INDEX(Tabelle,$C10,10)=\"\",\"fehlt\",INDEX(Tabelle,$C10,10))","v":{"v":1E-4,"d":"0"}},{"$f":"IF(INDEX(Tabelle,$C10,11)=\"\",\"fehlt\",INDEX(Tabelle,$C10,11))","v":{"v":1E-4,"d":"0"}},{"$f":"IF(INDEX(Tabelle,$C10,19)=\"\",\"fehlt\",INDEX(Tabelle,$C10,19))","v":{"v":1E-4,"d":"0.0"}},{"$f":"IF(INDEX(Tabelle,$C10,20)=\"\",\"fehlt\",INDEX(Tabelle,$C10,20))","v":{"v":1E-4,"d":"0.0"}},{"$f":"IF(INDEX(Tabelle,$C10,21)=\"\",\"fehlt\",INDEX(Tabelle,$C10,21))","v":{"v":1E-4,"d":"0.0"}},{"$f":"IF(INDEX(Tabelle,$C10,22)=\"\",\"fehlt\",INDEX(Tabelle,$C10,22))","v":{"v":1E-4,"d":"0.0"}},{"$f":"IF(INDEX(Tabelle,$C10,25)=\"\",\"\",INDEX(Tabelle,$C10,25)/100)","v":""},{"$f":"IF(G10=\"\",0,IF(Mast_Eingabe=2,B10,B10/G10*100))","v":{"v":0,"d":"0.00"}},{"$f":"IF(G10=\"\",0,IF(Mast_Eingabe=1,B10,B10*G10/100))","v":{"v":0,"d":"0.00"}},{"$f":"$U10*H10","v":{"v":0,"d":"0.0"}},{"v":0,"d":"0.0"},{"v":0,"d":"0.0"},{"v":0,"d":"0.0"},{"v":0,"d":"0.0"},{"v":0,"d":"0.0"},{"v":0,"d":"0.0"},{"v":0,"d":"0.0"},{"v":0,"d":"0.0"},{"v":0,"d":"0.0"},{"v":0,"d":"0.0"},{"$f":"IF(S10=\"\",\"\",$T10*S10)","v":""}]
[null,null,77,{"$f":"INDEX(Tabelle,$C11,1)","v":0},null,{"$f":"IF(INDEX(Tabelle,$C11,22)=\"\",\"\",1)","v":1},{"$f":"IF(INDEX(Tabelle,$C11,2)=\"\",\"fehlt\",INDEX(Tabelle,$C11,2)/10)","v":{"v":1e-05,"d":"0.0"}},{"$f":"IF(INDEX(Tabelle,$C11,4)=\"\",\"fehlt\",INDEX(Tabelle,$C11,4))","v":{"v":1E-4,"d":"0.0"}},{"$f":"IF(INDEX(Tabelle,$C11,7)=\"\",\"fehlt\",INDEX(Tabelle,$C11,7))","v":{"v":1E-4,"d":"0"}},{"$f":"IF(INDEX(Tabelle,$C11,8)=\"\",\"fehlt\",INDEX(Tabelle,$C11,8))","v":{"v":1E-4,"d":"0.0"}},{"$f":"IF(INDEX(Tabelle,$C11,12)=\"\",\"fehlt\",INDEX(Tabelle,$C11,12))","v":{"v":1E-4,"d":"0"}},{"$f":"IF(INDEX(Tabelle,$C11,9)=\"\",\"fehlt\",INDEX(Tabelle,$C11,9))","v":{"v":1E-4,"d":"0.00"}},{"$f":"IF(INDEX(Tabelle,$C11,10)=\"\",\"fehlt\",INDEX(Tabelle,$C11,10))","v":{"v":1E-4,"d":"0"}},{"$f":"IF(INDEX(Tabelle,$C11,11)=\"\",\"fehlt\",INDEX(Tabelle,$C11,11))","v":{"v":1E-4,"d":"0"}},{"$f":"IF(INDEX(Tabelle,$C11,19)=\"\",\"fehlt\",INDEX(Tabelle,$C11,19))","v":{"v":1E-4,"d":"0.0"}},{"$f":"IF(INDEX(Tabelle,$C11,20)=\"\",\"fehlt\",INDEX(Tabelle,$C11,20))","v":{"v":1E-4,"d":"0.0"}},{"$f":"IF(INDEX(Tabelle,$C11,21)=\"\",\"fehlt\",INDEX(Tabelle,$C11,21))","v":{"v":1E-4,"d":"0.0"}},{"$f":"IF(INDEX(Tabelle,$C11,22)=\"\",\"fehlt\",INDEX(Tabelle,$C11,22))","v":{"v":1E-4,"d":"0.0"}},{"$f":"IF(INDEX(Tabelle,$C11,25)=\"\",\"\",INDEX(Tabelle,$C11,25)/100)","v":""},{"$f":"IF(G11=\"\",0,IF(Mast_Eingabe=2,B11,B11/G11*100))","v":{"v":0,"d":"0.00"}},{"$f":"IF(G11=\"\",0,IF(Mast_Eingabe=1,B11,B11*G11/100))","v":{"v":0,"d":"0.00"}},{"v":0,"d":"0.0"},{"v":0,"d":"0.0"},{"v":0,"d":"0.0"},{"v":0,"d":"0.0"},{"v":0,"d":"0.0"},{"v":0,"d":"0.0"},{"v":0,"d":"0.0"},{"v":0,"d":"0.0"},{"v":0,"d":"0.0"},{"v":0,"d":"0.0"},{"v":0,"d":"0.0"},{"$f":"IF(S11=\"\",\"\",$T11*S11)","v":""}]
[null,null,77,{"$f":"INDEX(Tabelle,$C12,1)","v":0},null,{"$f":"IF(INDEX(Tabelle,$C12,22)=\"\",\"\",1)","v":1},{"$f":"IF(INDEX(Tabelle,$C12,2)=\"\",\"fehlt\",INDEX(Tabelle,$C12,2)/10)","v":{"v":1e-05,"d":"0.0"}},{"$f":"IF(INDEX(Tabelle,$C12,4)=\"\",\"fehlt\",INDEX(Tabelle,$C12,4))","v":{"v":1E-4,"d":"0.0"}},{"$f":"IF(INDEX(Tabelle,$C12,7)=\"\",\"fehlt\",INDEX(Tabelle,$C12,7))","v":{"v":1E-4,"d":"0"}},{"$f":"IF(INDEX(Tabelle,$C12,8)=\"\",\"fehlt\",INDEX(Tabelle,$C12,8))","v":{"v":1E-4,"d":"0.0"}},{"$f":"IF(INDEX(Tabelle,$C12,12)=\"\",\"fehlt\",INDEX(Tabelle,$C12,12))","v":{"v":1E-4,"d":"0"}},{"$f":"IF(INDEX(Tabelle,$C12,9)=\"\",\"fehlt\",INDEX(Tabelle,$C12,9))","v":{"v":1E-4,"d":"0.00"}},{"$f":"IF(INDEX(Tabelle,$C12,10)=\"\",\"fehlt\",INDEX(Tabelle,$C12,10))","v":{"v":1E-4,"d":"0"}},{"$f":"IF(INDEX(Tabelle,$C12,11)=\"\",\"fehlt\",INDEX(Tabelle,$C12,11))","v":{"v":1E-4,"d":"0"}},{"$f":"IF(INDEX(Tabelle,$C12,19)=\"\",\"fehlt\",INDEX(Tabelle,$C12,19))","v":{"v":1E-4,"d":"0.0"}},{"$f":"IF(INDEX(Tabelle,$C12,20)=\"\",\"fehlt\",INDEX(Tabelle,$C12,20))","v":{"v":1E-4,"d":"0.0"}},{"$f":"IF(INDEX(Tabelle,$C12,21)=\"\",\"fehlt\",INDEX(Tabelle,$C12,21))","v":{"v":1E-4,"d":"0.0"}},{"$f":"IF(INDEX(Tabelle,$C12,22)=\"\",\"fehlt\",INDEX(Tabelle,$C12,22))","v":{"v":1E-4,"d":"0.0"}},{"$f":"IF(INDEX(Tabelle,$C12,25)=\"\",\"\",INDEX(Tabelle,$C12,25)/100)","v":""},{"$f":"IF(G12=\"\",0,IF(Mast_Eingabe=2,B12,B12/G12*100))","v":{"v":0,"d":"0.00"}},{"$f":"IF(G12=\"\",0,IF(Mast_Eingabe=1,B12,B12*G12/100))","v":{"v":0,"d":"0.00"}},{"v":0,"d":"0.0"},{"v":0,"d":"0.0"},{"v":0,"d":"0.0"},{"v":0,"d":"0.0"},{"v":0,"d":"0.0"},{"v":0,"d":"0.0"},{"v":0,"d":"0.0"},{"v":0,"d":"0.0"},{"v":0,"d":"0.0"},{"v":0,"d":"0.0"},{"v":0,"d":"0.0"},{"$f":"IF(S12=\"\",\"\",$T12*S12)","v":""}]
[null,null,77,{"$f":"INDEX(Tabelle,$C13,1)","v":0},null,{"$f":"IF(INDEX(Tabelle,$C13,22)=\"\",\"\",1)","v":1},{"$f":"IF(INDEX(Tabelle,$C13,2)=\"\",\"fehlt\",INDEX(Tabelle,$C13,2)/10)","v":{"v":1e-05,"d":"0.0"}},{"$f":"IF(INDEX(Tabelle,$C13,4)=\"\",\"fehlt\",INDEX(Tabelle,$C13,4))","v":{"v":1E-4,"d":"0.0"}},{"$f":"IF(INDEX(Tabelle,$C13,7)=\"\",\"fehlt\",INDEX(Tabelle,$C13,7))","v":{"v":1E-4,"d":"0"}},{"$f":"IF(INDEX(Tabelle,$C13,8)=\"\",\"fehlt\",INDEX(Tabelle,$C13,8))","v":{"v":1E-4,"d":"0.0"}},{"$f":"IF(INDEX(Tabelle,$C13,12)=\"\",\"fehlt\",INDEX(Tabelle,$C13,12))","v":{"v":1E-4,"d":"0"}},{"$f":"IF(INDEX(Tabelle,$C13,9)=\"\",\"fehlt\",INDEX(Tabelle,$C13,9))","v":{"v":1E-4,"d":"0.00"}},{"$f":"IF(INDEX(Tabelle,$C13,10)=\"\",\"fehlt\",INDEX(Tabelle,$C13,10))","v":{"v":1E-4,"d":"0"}},{"$f":"IF(INDEX(Tabelle,$C13,11)=\"\",\"fehlt\",INDEX(Tabelle,$C13,11))","v":{"v":1E-4,"d":"0"}},{"$f":"IF(INDEX(Tabelle,$C13,19)=\"\",\"fehlt\",INDEX(Tabelle,$C13,19))","v":{"v":1E-4,"d":"0.0"}},{"$f":"IF(INDEX(Tabelle,$C13,20)=\"\",\"fehlt\",INDEX(Tabelle,$C13,20))","v":{"v":1E-4,"d":"0.0"}},{"$f":"IF(INDEX(Tabelle,$C13,21)=\"\",\"fehlt\",INDEX(Tabelle,$C13,21))","v":{"v":1E-4,"d":"0.0"}},{"$f":"IF(INDEX(Tabelle,$C13,22)=\"\",\"fehlt\",INDEX(Tabelle,$C13,22))","v":{"v":1E-4,"d":"0.0"}},{"$f":"IF(INDEX(Tabelle,$C13,25)=\"\",\"\",INDEX(Tabelle,$C13,25)/100)","v":""},{"$f":"IF(G13=\"\",0,IF(Mast_Eingabe=2,B13,B13/G13*100))","v":{"v":0,"d":"0.00"}},{"$f":"IF(G13=\"\",0,IF(Mast_Eingabe=1,B13,B13*G13/100))","v":{"v":0,"d":"0.00"}},{"v":0,"d":"0.0"},{"v":0,"d":"0.0"},{"v":0,"d":"0.0"},{"v":0,"d":"0.0"},{"v":0,"d":"0.0"},{"v":0,"d":"0.0"},{"v":0,"d":"0.0"},{"v":0,"d":"0.0"},{"v":0,"d":"0.0"},{"v":0,"d":"0.0"},{"v":0,"d":"0.0"},{"$f":"IF(S13=\"\",\"\",$T13*S13)","v":""}]
[null,null,77,{"$f":"INDEX(Tabelle,$C14,1)","v":0},null,{"$f":"IF(INDEX(Tabelle,$C14,22)=\"\",\"\",1)","v":1},{"$f":"IF(INDEX(Tabelle,$C14,2)=\"\",\"fehlt\",INDEX(Tabelle,$C14,2)/10)","v":{"v":1e-05,"d":"0.0"}},{"$f":"IF(INDEX(Tabelle,$C14,4)=\"\",\"fehlt\",INDEX(Tabelle,$C14,4))","v":{"v":1E-4,"d":"0.0"}},{"$f":"IF(INDEX(Tabelle,$C14,7)=\"\",\"fehlt\",INDEX(Tabelle,$C14,7))","v":{"v":1E-4,"d":"0"}},{"$f":"IF(INDEX(Tabelle,$C14,8)=\"\",\"fehlt\",INDEX(Tabelle,$C14,8))","v":{"v":1E-4,"d":"0.0"}},{"$f":"IF(INDEX(Tabelle,$C14,12)=\"\",\"fehlt\",INDEX(Tabelle,$C14,12))","v":{"v":1E-4,"d":"0"}},{"$f":"IF(INDEX(Tabelle,$C14,9)=\"\",\"fehlt\",INDEX(Tabelle,$C14,9))","v":{"v":1E-4,"d":"0.00"}},{"$f":"IF(INDEX(Tabelle,$C14,10)=\"\",\"fehlt\",INDEX(Tabelle,$C14,10))","v":{"v":1E-4,"d":"0"}},{"$f":"IF(INDEX(Tabelle,$C14,11)=\"\",\"fehlt\",INDEX(Tabelle,$C14,11))","v":{"v":1E-4,"d":"0"}},{"$f":"IF(INDEX(Tabelle,$C14,19)=\"\",\"fehlt\",INDEX(Tabelle,$C14,19))","v":{"v":1E-4,"d":"0.0"}},{"$f":"IF(INDEX(Tabelle,$C14,20)=\"\",\"fehlt\",INDEX(Tabelle,$C14,20))","v":{"v":1E-4,"d":"0.0"}},{"$f":"IF(INDEX(Tabelle,$C14,21)=\"\",\"fehlt\",INDEX(Tabelle,$C14,21))","v":{"v":1E-4,"d":"0.0"}},{"$f":"IF(INDEX(Tabelle,$C14,22)=\"\",\"fehlt\",INDEX(Tabelle,$C14,22))","v":{"v":1E-4,"d":"0.0"}},{"$f":"IF(INDEX(Tabelle,$C14,25)=\"\",\"\",INDEX(Tabelle,$C14,25)/100)","v":""},{"$f":"IF(G14=\"\",0,IF(Mast_Eingabe=2,B14,B14/G14*100))","v":{"v":0,"d":"0.00"}},{"$f":"IF(G14=\"\",0,IF(Mast_Eingabe=1,B14,B14*G14/100))","v":{"v":0,"d":"0.00"}},{"v":0,"d":"0.0"},{"v":0,"d":"0.0"},{"v":0,"d":"0.0"},{"v":0,"d":"0.0"},{"v":0,"d":"0.0"},{"v":0,"d":"0.0"},{"v":0,"d":"0.0"},{"v":0,"d":"0.0"},{"v":0,"d":"0.0"},{"v":0,"d":"0.0"},{"v":0,"d":"0.0"},{"$f":"IF(S14=\"\",\"\",$T14*S14)","v":""}]
[{"$nulls":17},"Summe",1,{"$f":"SUM(T10:T14)","v":{"v":0,"d":"0.00"}},{"$f":"SUM(U10:U14)","v":{"v":0,"d":"0.00"}},{"v":0,"d":"0.0"},0,{"v":0,"d":"0.0"},0,0,0,0,0,0,0,{"$f":"SUM(AF10:AF14)","v":0},{"$f":"SUM(AG10:AG14)","v":{"v":0,"d":"0.00"}},null,525,{"$f":"AI15^0.75*0.53","v":{"v":58.12933399645895,"d":"58.1"}},{"$f":"AI15","v":{"v":525,"d":"525.0"}},20.1,30.8,44.4,{"$nulls":6},{"$f":"AL15/AU$7*1000","v":33.5},{"$f":"AM15/AV$7*1000","v":38.5},{"$f":"AN15/AW$7*1000","v":44.4},{"$nulls":3},{"$f":"MEDIAN(AU15:AZ15)","v":38.5},{"$nulls":11},{"$f":"AI15","v":525},{"$f":"(-19.7+4.55*LN($BM15)+0.00066*BN$7)*$U$5","v":{"v":9.194462094791888,"d":"9.19"}},{"v":9.326462094791887,"d":"9.33"},{"v":9.458462094791887,"d":"9.46"},{"v":9.590462094791887,"d":"9.59"},{"v":9.722462094791886,"d":"9.72"},{"v":9.854462094791888,"d":"9.85"},null,{"$f":"BM15","v":525},{"$f":"AU15/BN15","v":{"v":3.6434975373900063,"d":"3.64"}},{"$f":"AV15/BO15","v":{"v":4.128039079416759,"d":"4.13"}},{"$f":"AW15/BP15","v":{"v":4.694209222918805,"d":"4.69"}}]
[{"$nulls":3},"Konzentrate, rationiert",{"$nulls":14},1,"je kg TM",{"$f":"IF(U15=0,\"\",U15/T15)","v":""},{"$f":"IF($U15=0,0,V15/$U15)","v":{"v":0,"d":"0.00"}},{"$f":"IF($U15=0,0,W15/$U15)","v":{"v":0,"d":"0.00"}},{"v":0,"d":"0.00"},{"v":0,"d":"0.00"},{"v":0,"d":"0.00"},{"v":0,"d":"0.00"},{"v":0,"d":"0.00"},{"v":0,"d":"0.00"},{"v":0,"d":"0.00"},{"v":0,"d":"0.00"},{"v":0,"d":"0.00"},{"$f":"IF(U15=0,0,AG15/$U15)","v":{"v":0,"d":"0.00"}}]
[]
[null,null,77,{"$f":"INDEX(Tabelle,$C18,1)","v":0},null,{"$f":"IF(INDEX(Tabelle,$C18,22)=\"\",\"\",1)","v":1},{"$f":"IF(INDEX(Tabelle,$C18,2)=\"\",\"fehlt\",INDEX(Tabelle,$C18,2)/10)","v":{"v":1e-05,"d":"0.0"}},{"$f":"IF(INDEX(Tabelle,$C18,4)=\"\",\"fehlt\",INDEX(Tabelle,$C18,4))","v":{"v":1E-4,"d":"0.0"}},{"$f":"IF(INDEX(Tabelle,$C18,7)=\"\",\"fehlt\",INDEX(Tabelle,$C18,7))","v":{"v":1E-4,"d":"0"}},{"$f":"IF(INDEX(Tabelle,$C18,8)=\"\",\"fehlt\",INDEX(Tabelle,$C18,8))","v":{"v":1E-4,"d":"0.0"}},{"$f":"IF(INDEX(Tabelle,$C18,12)=\"\",\"fehlt\",INDEX(Tabelle,$C18,12))","v":{"v":1E-4,"d":"0"}},{"$f":"IF(INDEX(Tabelle,$C18,9)=\"\",\"fehlt\",INDEX(Tabelle,$C18,9))","v":{"v":1E-4,"d":"0.00"}},{"$f":"IF(INDEX(Tabelle,$C18,10)=\"\",\"fehlt\",INDEX(Tabelle,$C18,10))","v":{"v":1E-4,"d":"0"}},{"$f":"IF(INDEX(Tabelle,$C18,11)=\"\",\"fehlt\",INDEX(Tabelle,$C18,11))","v":{"v":1E-4,"d":"0"}},{"$f":"IF(INDEX(Tabelle,$C18,19)=\"\",\"fehlt\",INDEX(Tabelle,$C18,19))","v":{"v":1E-4,"d":"0.0"}},{"$f":"IF(INDEX(Tabelle,$C18,20)=\"\",\"fehlt\",INDEX(Tabelle,$C18,20))","v":{"v":1E-4,"d":"0.0"}},{"$f":"IF(INDEX(Tabelle,$C18,21)=\"\",\"fehlt\",INDEX(Tabelle,$C18,21))","v":{"v":1E-4,"d":"0.0"}},{"$f":"IF(INDEX(Tabelle,$C18,22)=\"\",\"fehlt\",INDEX(Tabelle,$C18,22))","v":{"v":1E-4,"d":"0.0"}},{"$f":"IF(INDEX(Tabelle,$C18,25)=\"\",\"\",INDEX(Tabelle,$C18,25)/100)","v":""},{"$f":"IF(G18=\"\",0,IF(Mast_Eingabe=2,B18,B18/G18*100))","v":{"v":0,"d":"0.00"}},{"$f":"IF(G18=\"\",0,IF(Mast_Eingabe=1,B18,B18*G18/100))","v":{"v":0,"d":"0.00"}},{"$f":"$U18*H18","v":{"v":0,"d":"0.0"}},{"v":0,"d":"0.0"},{"v":0,"d":"0.0"},{"v":0,"d":"0.0"},{"v":0,"d":"0.0"},{"v":0,"d":"0.0"},{"v":0,"d":"0.0"},{"v":0,"d":"0.0"},{"v":0,"d":"0.0"},{"v":0,"d":"0.0"},{"v":0,"d":"0.0"},{"$f":"IF(S18=\"\",\"\",$T18*S18)","v":""}]
[null,null,77,{"$f":"INDEX(Tabelle,$C19,1)","v":0},null,{"$f":"IF(INDEX(Tabelle,$C19,22)=\"\",\"\",1)","v":1},{"$f":"IF(INDEX(Tabelle,$C19,2)=\"\",\"fehlt\",INDEX(Tabelle,$C19,2)/10)","v":{"v":1e-05,"d":"0.0"}},{"$f":"IF(INDEX(Tabelle,$C19,4)=\"\",\"fehlt\",INDEX(Tabelle,$C19,4))","v":{"v":1E-4,"d":"0.0"}},{"$f":"IF(INDEX(Tabelle,$C19,7)=\"\",\"fehlt\",INDEX(Tabelle,$C19,7))","v":{"v":1E-4,"d":"0"}},{"$f":"IF(INDEX(Tabelle,$C19,8)=\"\",\"fehlt\",INDEX(Tabelle,$C19,8))","v":{"v":1E-4,"d":"0.0"}},{"$f":"IF(INDEX(Tabelle,$C19,12)=\"\",\"fehlt\",INDEX(Tabelle,$C19,12))","v":{"v":1E-4,"d":"0"}},{"$f":"IF(INDEX(Tabelle,$C19,9)=\"\",\"fehlt\",INDEX(Tabelle,$C19,9))","v":{"v":1E-4,"d":"0.00"}},{"$f":"IF(INDEX(Tabelle,$C19,10)=\"\",\"fehlt\",INDEX(Tabelle,$C19,10))","v":{"v":1E-4,"d":"0"}},{"$f":"IF(INDEX(Tabelle,$C19,11)=\"\",\"fehlt\",INDEX(Tabelle,$C19,11))","v":{"v":1E-4,"d":"0"}},{"$f":"IF(INDEX(Tabelle,$C19,19)=\"\",\"fehlt\",INDEX(Tabelle,$C19,19))","v":{"v":1E-4,"d":"0.0"}},{"$f":"IF(INDEX(Tabelle,$C19,20)=\"\",\"fehlt\",INDEX(Tabelle,$C19,20))","v":{"v":1E-4,"d":"0.0"}},{"$f":"IF(INDEX(Tabelle,$C19,21)=\"\",\"fehlt\",INDEX(Tabelle,$C19,21))","v":{"v":1E-4,"d":"0.0"}},{"$f":"IF(INDEX(Tabelle,$C19,22)=\"\",\"fehlt\",INDEX(Tabelle,$C19,22))","v":{"v":1E-4,"d":"0.0"}},{"$f":"IF(INDEX(Tabelle,$C19,25)=\"\",\"\",INDEX(Tabelle,$C19,25)/100)","v":""},{"$f":"IF(G19=\"\",0,IF(Mast_Eingabe=2,B19,B19/G19*100))","v":{"v":0,"d":"0.00"}},{"$f":"IF(G19=\"\",0,IF(Mast_Eingabe=1,B19,B19*G19/100))","v":{"v":0,"d":"0.00"}},{"v":0,"d":"0.0"},{"v":0,"d":"0.0"},{"v":0,"d":"0.0"},{"v":0,"d":"0.0"},{"v":0,"d":"0.0"},{"v":0,"d":"0.0"},{"v":0,"d":"0.0"},{"v":0,"d":"0.0"},{"v":0,"d":"0.0"},{"v":0,"d":"0.0"},{"v":0,"d":"0.0"},{"$f":"IF(S19=\"\",\"\",$T19*S19)","v":""}]
[null,null,77,{"$f":"INDEX(Tabelle,$C20,1)","v":0},null,{"$f":"IF(INDEX(Tabelle,$C20,22)=\"\",\"\",1)","v":1},{"$f":"IF(INDEX(Tabelle,$C20,2)=\"\",\"fehlt\",INDEX(Tabelle,$C20,2)/10)","v":{"v":1e-05,"d":"0.0"}},{"$f":"IF(INDEX(Tabelle,$C20,4)=\"\",\"fehlt\",INDEX(Tabelle,$C20,4))","v":{"v":1E-4,"d":"0.0"}},{"$f":"IF(INDEX(Tabelle,$C20,7)=\"\",\"fehlt\",INDEX(Tabelle,$C20,7))","v":{"v":1E-4,"d":"0"}},{"$f":"IF(INDEX(Tabelle,$C20,8)=\"\",\"fehlt\",INDEX(Tabelle,$C20,8))","v":{"v":1E-4,"d":"0.0"}},{"$f":"IF(INDEX(Tabelle,$C20,12)=\"\",\"fehlt\",INDEX(Tabelle,$C20,12))","v":{"v":1E-4,"d":"0"}},{"$f":"IF(INDEX(Tabelle,$C20,9)=\"\",\"fehlt\",INDEX(Tabelle,$C20,9))","v":{"v":1E-4,"d":"0.00"}},{"$f":"IF(INDEX(Tabelle,$C20,10)=\"\",\"fehlt\",INDEX(Tabelle,$C20,10))","v":{"v":1E-4,"d":"0"}},{"$f":"IF(INDEX(Tabelle,$C20,11)=\"\",\"fehlt\",INDEX(Tabelle,$C20,11))","v":{"v":1E-4,"d":"0"}},{"$f":"IF(INDEX(Tabelle,$C20,19)=\"\",\"fehlt\",INDEX(Tabelle,$C20,19))","v":{"v":1E-4,"d":"0.0"}},{"$f":"IF(INDEX(Tabelle,$C20,20)=\"\",\"fehlt\",INDEX(Tabelle,$C20,20))","v":{"v":1E-4,"d":"0.0"}},{"$f":"IF(INDEX(Tabelle,$C20,21)=\"\",\"fehlt\",INDEX(Tabelle,$C20,21))","v":{"v":1E-4,"d":"0.0"}},{"$f":"IF(INDEX(Tabelle,$C20,22)=\"\",\"fehlt\",INDEX(Tabelle,$C20,22))","v":{"v":1E-4,"d":"0.0"}},{"$f":"IF(INDEX(Tabelle,$C20,25)=\"\",\"\",INDEX(Tabelle,$C20,25)/100)","v":""},{"$f":"IF(G20=\"\",0,IF(Mast_Eingabe=2,B20,B20/G20*100))","v":{"v":0,"d":"0.00"}},{"$f":"IF(G20=\"\",0,IF(Mast_Eingabe=1,B20,B20*G20/100))","v":{"v":0,"d":"0.00"}},{"v":0,"d":"0.0"},{"v":0,"d":"0.0"},{"v":0,"d":"0.0"},{"v":0,"d":"0.0"},{"v":0,"d":"0.0"},{"v":0,"d":"0.0"},{"v":0,"d":"0.0"},{"v":0,"d":"0.0"},{"v":0,"d":"0.0"},{"v":0,"d":"0.0"},{"v":0,"d":"0.0"},{"$f":"IF(S20=\"\",\"\",$T20*S20)","v":""},{"$nulls":3},"a",18.1285,21.2061,26.1231,30.7674,35.8128]
[{"$nulls":20},{"$f":"SUM(U18:U20)","v":{"v":0,"d":"0.00"}},{"$f":"IF(U21=0,0,SUM(V18:V20)/U21)","v":{"v":0,"d":"0.0"}},{"$f":"IF(U21=0,0,SUM(W18:W20)/U21)","v":{"v":0,"d":"0.0"}},{"$nulls":9},{"$f":"SUM(AG16:AG20)","v":{"v":0,"d":"0.00"}}]
[{"$nulls":17},"Summe",1,{"$f":"SUM(T18:T20,T10:T14)","v":{"v":0,"d":"0.00"}},{"v":0,"d":"0.00"},{"v":0,"d":"0.0"},0,{"v":0,"d":"0.0"},0,0,0,0,0,0,0,{"$f":"SUM(AF18:AF20,AF10:AF14)","v":0},{"$f":"SUM(AG18:AG20)","v":{"v":0,"d":"0.00"}},{"$nulls":3},"b",0.000584,0.000653,0.00061,4.15E-4,0.00036]
[{"$nulls":17},{"$f":"\"Bedarf bei \"&U3&\" kg LM\"","v":"Bedarf bei 350 kg LM"},null,null,{"$f":"IF(Mast_GF_TM1=0,0,IF(Mast_Rasse=3,4.4*LN(Mast_LM)+$V$24*1.06-28.7,0.173+0.01372*Mast_LM+1.47*Mast_LMZ/1000)*$U$5)","v":{"v":0,"d":"0.0"}},{"$f":"Mast_LM^0.75*0.53+IF(Mast_Rasse=1,Mast_LMZ/1000*(11.8738*EXP(0.00232*Mast_LM)),IF(Mast_Rasse=2,Mast_LMZ/1000*(21.156*EXP(0.00065*Mast_LM)),Mast_LMZ/1000*(12.0882*EXP(0.00248*Mast_LM))))","v":{"v":65.92376718791292,"d":"65.9"}},{"$f":"Mast_LM^0.524*16.9+IF(Mast_Rasse=1,Mast_LMZ/1000*(369+0.249*Mast_LM-0.0004*Mast_LM^2),IF(Mast_Rasse=2,Mast_LMZ/1000*(Mast_LM^0.1435*193),Mast_LMZ/1000*(264+0.492*Mast_LM-0.00103*Mast_LM^2)))","v":{"v":611.9169033188796,"d":"612"}},{"$f":"(-19.7+4.55*LN($U$3)+0.00066*$U$4)*X5","v":0},{"$f":"\"< \"&ROUND($U22*400,0)","v":"< 0"},{"$f":"\"> \"&ROUND($U22*1.2,1)","v":"> 0"},{"$f":"\"> \"&ROUND($U22*195,0)","v":"> 0"},{"$f":"\"> \"&ROUND($U22*320,0)","v":"> 0"},{"$f":"U23*2+0.0212*Mast_LMZ+5.8","v":{"v":22.76,"d":"23"}},{"$f":"U23*1.4+Mast_LMZ*0.0095+1.3","v":{"v":8.9,"d":"9"}},{"$f":"U23*1+Mast_LMZ*0.0024+0.1","v":{"v":2.02,"d":"2"}},{"$f":"U23*0.7+Mast_LMZ*0.0017","v":{"v":1.3599999999999999,"d":"1"}},"€/kg KF",null,"Tabellen","FV","Ansatz",{"$f":"AL20*EXP(AL22*$U$3)","v":22.239840232073725},{"$f":"AM20*EXP(AM22*$U$3)","v":26.651325218246846},{"$f":"AN20*EXP(AN22*$U$3)","v":32.34048918560704},{"$f":"AO20*EXP(AO22*$U$3)","v":35.577225068835894},{"$f":"AP20*EXP(AP22*$U$3)","v":40.62182043628632},{"$nulls":23},"IT",{"$nulls":6},"MJNEL"]
[{"$nulls":17},"je kg TM",null,null,{"$f":"IF(U22=0,\"\",U22/T22)","v":""},{"$f":"IF($U22=0,0,ROUND(V22/$U22,2))","v":{"v":0,"d":"0.00"}},{"$f":"IF($U22=0,0,ROUND(W22/$U22,2))","v":{"v":0,"d":"0.00"}},{"v":0,"d":"0.00"},{"v":0,"d":"0.00"},{"v":0,"d":"0.00"},{"v":0,"d":"0.00"},{"v":0,"d":"0.00"},{"v":0,"d":"0.00"},{"v":0,"d":"0.00"},{"v":0,"d":"0.00"},{"v":0,"d":"0.00"},{"$f":"IF(AG22=0,0,AG22/SUM(U18:U20))","v":{"v":0,"d":"0.00"}},null,"LM","Erhaltung",null,800,1000,1200,1400,1600,{"$nulls":4},{"$f":"AL24","v":800},{"$f":"AM24","v":1000},{"$f":"AN24","v":1200},{"$f":"AO24","v":1400},{"$f":"AP24","v":1600},"Mittelwert",{"$nulls":13},{"$f":"AU24","v":800},{"$f":"AV24","v":1000},{"$f":"AW24","v":1200},{"$f":"AX24","v":1400},{"$f":"AY24","v":1600},1600,null,null,{"$f":"BN24","v":800},{"$f":"BO24","v":1000},{"$f":"BP24","v":1200},{"$f":"BQ24","v":1400},{"$f":"BR24","v":1600}]
[{"$nulls":17},"Lebendmasse",{"$nulls":3},{"v":150,"d":"150 kg"},{"v":200,"d":"200 kg"},{"v":250,"d":"250 kg"},{"v":300,"d":"300 kg"},{"v":350,"d":"350 kg"},{"v":400,"d":"400 kg"},{"v":450,"d":"450 kg"},{"v":500,"d":"500 kg"},{"v":550,"d":"550 kg"},{"v":600,"d":"600 kg"},{"v":650,"d":"650 kg"}]
[{"$nulls":17},"Futteraufnahme",{"$nulls":3},{"$f":"IF($U22=0,0,IF(Mast_Rasse=3,4.4*LN(V25)+$V$24*1.06-28.7,0.173+0.01372*V25+1.47*Mast_LMZ/1000)*$U$5)","v":{"v":0,"d":"0.0"}},{"v":0,"d":"0.0"},{"v":0,"d":"0.0"},{"v":0,"d":"0.0"},{"v":0,"d":"0.0"},{"v":0,"d":"0.0"},{"v":0,"d":"0.0"},{"v":0,"d":"0.0"},{"v":0,"d":"0.0"},{"v":0,"d":"0.0"},{"v":0,"d":"0.0"}]
[{"$nulls":17},"MJ ME/kg TM reicht für ca. g LMZ",{"$nulls":3},{"$f":"IF($U22=0,0,ROUND(((V26-Mast_KF_TM1)*Mast_GF_ME1+Mast_KF_TM1*Mast_KF_ME1-(V25^0.75*0.53))/(IF(Mast_Rasse=1,11.8738*EXP(0.00232*V25),IF(Mast_Rasse=2,21.156*EXP(0.00065*V25),12.0882*EXP(0.00248*V25))))*1000,-1))","v":0},0,0,0,0,0,0,0,0,0,0]
[{"$nulls":17},"nXP-Versorgung",{"$nulls":3},{"$f":"IF($U22=0,0,((V26-Mast_KF_TM1)*Mast_GF_nXP1+Mast_KF_TM1*Mast_KF_nXP1-V25^0.524*16.9)/IF(Mast_Rasse=1,(369+0.249*V25-0.0004*V25^2),IF(Mast_Rasse=2,(193.4*V25^0.1435),(264+0.492*V25-0.00103*V25^2)))*1000)","v":0},0,0,0,0,0,0,0,0,0,0]
[{"$nulls":17},"Kosten €/Tag",null,null,{"$f":"IF(Mast_GF_TM1=0,\"\",IF(COUNTIF(S10:S22,\">0\")<>COUNTIF(U10:U22,\">0\"),\"Daten!\",\"\"))","v":""},{"$f":"(V26-SUM($U$18:$U$20))*$AG$16+SUM($U$18:$U$20)*$AG$24","v":{"v":0,"d":"0.00"}},{"v":0,"d":"0.00"},{"v":0,"d":"0.00"},{"v":0,"d":"0.00"},{"v":0,"d":"0.00"},{"v":0,"d":"0.00"},{"v":0,"d":"0.00"},{"v":0,"d":"0.00"},{"v":0,"d":"0.00"},{"v":0,"d":"0.00"},{"$f":"(AF26-SUM($U$18:$U$20))*$AG$16+SUM($U$18:$U$20)*$AG$24","v":{"v":0,"d":"0.00"}}]
[{"$nulls":35},325,{"$f":"AJ30^0.524*16.9","v":{"v":350.03670396963315,"d":"350.0"}},{"$f":"AJ30","v":325},{"$f":"(AU30*1.05-$AK30)/#REF!*1000","v":{"$error":"#REF!"}},{"$f":"(AV30*1.05-$AK30)/#REF!*1000","v":{"$error":"#REF!"}},{"$f":"(AW30*1.05-$AK30)/#REF!*1000","v":{"$error":"#REF!"}},{"$f":"(AX30*1.05-$AK30)/#REF!*1000","v":{"$error":"#REF!"}},{"$f":"(AY30*1.05-$AK30)/#REF!*1000","v":{"$error":"#REF!"}},null,{"$f":"AVERAGE(AM30:AR30)","v":{"$error":"#REF!"}},{"$f":"MAX(AM30:AR30)-AS30","v":{"$error":"#REF!"}},577,656,727,782,823]
[{"$nulls":36},"LMZ",{"$nulls":7},263.9]
[{"$nulls":36},"LMZ²",{"$nulls":7},0.492]
[{"$nulls":34},"Tabellen","JV","Ansatz",{"$f":"AL31*EXP(AL32*$U$3)","v":0},0,0,0,0,0,0,-0.00103]
[{"$nulls":34},"LM","Erhaltung",null,400,500,600,700,800,900,1000,"Mittelwert",null,{"$f":"AL34","v":400},500,600,700,800,900,1000]
[{"$nulls":34},150,{"$f":"AI35^0.524*16.9","v":{"v":233.43099668718983,"d":"233.4"}},{"$f":"AI35","v":{"v":150,"d":"150.0"}},null,{"$f":"(AV35*1-$AJ35)/AM$34*1000","v":{"v":301.13800662562033,"d":"301.1"}},null,null,{"$f":"(AY35*1-$AJ35)/AP$34*1000","v":{"v":320.7112541410128,"d":"320.7"}},null,null,{"$f":"AVERAGE(AL35:AR35)","v":{"v":310.9246303833165,"d":"310.9"}},{"$f":"MAX(AM35:AR35)-AS35","v":{"v":9.786623757696248,"d":"9.8"}},null,384,null,null,490]
[{"$nulls":34},200,{"$f":"AI36^0.524*16.9","v":{"v":271.4103607840435,"d":"271.4"}},{"$f":"AI36","v":{"v":200,"d":"200.0"}},null,{"v":319.17927843191296,"d":"319.2"},null,null,{"v":325.73704901994563,"d":"325.7"},null,null,{"$f":"AVERAGE(AL36:AR36)","v":{"v":322.4581637259293,"d":"322.5"}},{"$f":"MAX(AM36:AR36)-AS36","v":{"v":3.2788852940163338,"d":"3.3"}},null,431,null,null,532]
[{"$nulls":34},250,{"v":305.07545604809326,"d":"305.1"},{"v":250,"d":"250.0"},null,{"v":331.8490879038135,"d":"331.8"},null,null,{"v":321.15567993988344,"d":"321.2"},null,null,{"v":326.5023839218485,"d":"326.5"},{"v":5.346703981964993,"d":"5.3"},null,471,null,null,562]
[{"$nulls":34},300,{"v":335.65895803538746,"d":"335.7"},{"v":300,"d":"300.0"},null,{"v":330.6820839292251,"d":"330.7"},null,null,{"v":311.67630245576566,"d":"311.7"},null,null,{"v":321.1791931924954,"d":"321.2"},{"v":9.502890736729682,"d":"9.5"},null,501,null,null,585]
[{"$nulls":34},350,{"v":363.89690331887954,"d":"363.9"},{"v":350,"d":"350.0"},null,{"v":318.2061933622409,"d":"318.2"},null,null,{"v":300.12887085140056,"d":"300.1"},null,null,{"v":309.1675321068208,"d":"309.2"},{"v":9.038661255420152,"d":"9.0"},null,523,null,null,604]
[{"$nulls":34},400,{"v":390.2708731645493,"d":"390.3"},{"v":400,"d":"400.0"},null,{"v":307.4582536709014,"d":"307.5"},null,null,{"v":284.66140854431336,"d":"284.7"},null,null,{"v":296.05983110760735,"d":"296.1"},{"v":11.398422563294048,"d":"11.4"},null,544,null,null,618]
[{"$nulls":34},450,{"v":415.11656291945724,"d":"415.1"},{"v":450,"d":"450.0"},null,{"v":283.7668741610855,"d":"283.8"},null,null,{"v":267.35429635067845,"d":"267.4"},null,null,{"v":275.56058525588196,"d":"275.6"},{"v":8.206288905203564,"d":"8.2"},null,557,null,null,629]
[{"$nulls":34},500,{"v":438.6791435264996,"d":"438.7"},{"v":500,"d":"500.0"},null,{"v":242.64171294700077,"d":"242.6"},null,null,{"v":247.90107059187548,"d":"247.9"},null,null,{"v":245.27139176943814,"d":"245.3"},{"v":2.6296788224373415,"d":"2.6"},null,560,null,null,637]
[{"$nulls":34},550,{"v":461.14420339845276,"d":"461.1"},{"v":550,"d":"550.0"},null,{"v":227.71159320309448,"d":"227.7"},null,null,{"v":232.31974575193405,"d":"232.3"},null,null,{"v":230.01566947751428,"d":"230.0"},null,null,575,null,null,647]
[]
[]
[]
[{"$nulls":34},"Ca",null,"Erhaltung",null,500,800,800,1000,1200,1400,null,{"$f":"AM47","v":500},800,800,1000,1200,1400]
[{"$nulls":34},175,{"$f":"IF(Mast_Rasse=3,4.4*LN(AI48)+$V$24*1.06-28.7,0.173+0.01372*AI48+1.47*Mast_LMZ/1000)*$U$5","v":{"v":-5.974941714736534,"d":"-6.0"}},{"$f":"AJ48*2","v":-11.949883429473068},{"$f":"AI48","v":175},22,31,31,35,null,null,{"$f":"AI48","v":175},{"$f":"AM48-$AK48","v":33.94988342947307},{"$f":"AN48-$AK48","v":42.94988342947307},{"$f":"AO48-$AK48","v":42.94988342947307},{"$f":"AP48-$AK48","v":46.94988342947307}]
[{"$nulls":34},225,{"v":-4.869158230300549,"d":"-4.9"},{"$f":"AJ49*2","v":-9.738316460601098},{"$f":"AI49","v":225},24,33,33,36,39,null,225,33.7383164606011,42.7383164606011,42.7383164606011,45.7383164606011,{"$f":"AQ49-$AK49","v":48.7383164606011}]
[{"$nulls":34},275,{"v":-3.9862071702670825,"d":"-4.0"},-7.972414340534165,275,26,35,34,39,42,46,275,33.972414340534165,42.972414340534165,41.972414340534165,46.972414340534165,49.972414340534165,{"$f":"AR50-$AK50","v":53.972414340534165}]
[{"$nulls":34},325,{"v":-3.251169197749153,"d":"-3.3"},-6.502338395498306,325,27,36,35,39,42,47,325,33.502338395498306,42.502338395498306,41.502338395498306,45.502338395498306,48.502338395498306,53.502338395498306]
[{"$nulls":34},375,{"v":-2.621525485730192,"d":"-2.6"},-5.243050971460384,375,28,37,37,41,43,48,375,33.243050971460384,42.243050971460384,42.243050971460384,46.243050971460384,48.243050971460384,53.243050971460384]
[{"$nulls":34},425,{"v":-2.070807656732562,"d":"-2.1"},-4.141615313465124,425,29,38,38,41,44,50,425,33.141615313465124,42.141615313465124,42.141615313465124,45.141615313465124,48.141615313465124,54.141615313465124]
[{"$nulls":34},475,{"v":-1.581414862247577,"d":"-1.6"},-3.162829724495154,475,30,41,39,43,45,50,475,33.162829724495154,44.162829724495154,42.162829724495154,46.162829724495154,48.162829724495154,53.162829724495154]
[{"$nulls":34},525,{"v":-1.1410476445968527,"d":"-1.1"},-2.2820952891937054,525,30,42,39,43,46,51,525,32.282095289193705,44.282095289193705,41.282095289193705,45.282095289193705,48.282095289193705,53.282095289193705]
[{"$nulls":34},575,{"v":-0.7407718204916556,"d":"-0.7"},-1.4815436409833111,575,31,43,40,44,47,null,575,32.48154364098331,44.48154364098331,41.48154364098331,45.48154364098331,48.48154364098331]
[{"$nulls":34},625,{"v":-0.37389274115983184,"d":"-0.4"},-0.7477854823196637,625,null,null,41,45,48,null,625,null,null,{"$f":"AO57-$AK57","v":41.747785482319664},{"$f":"AP57-$AK57","v":45.747785482319664},48.747785482319664]
[{"$nulls":44},"Mittelwert Ca",{"$f":"AVERAGE(AT48:AT57)","v":33.27489861841159},43.16378750730048,42.0221873048024,45.9221873048024,48.58577662428344,53.55072400577448]
[]
[]
[]
[{"$nulls":34},"P",null,"Erhaltung",null,500,800,800,1000,1200,1400,null,{"$f":"AM62","v":500},800,800,1000,1200,1400]
[{"$nulls":34},175,{"$f":"IF(Mast_Rasse=3,4.4*LN(AI63)+$V$24*1.06-28.7,0.173+0.01372*AI63+1.47*Mast_LMZ/1000)*$U$5","v":{"v":-5.974941714736534,"d":"-6.0"}},{"$f":"AJ63*1.4","v":-8.364918400631147},{"$f":"AI63","v":175},11,14,14,16,null,null,{"$f":"AI63","v":175},{"$f":"AM63-$AK63","v":19.364918400631147},{"$f":"AN63-$AK63","v":22.364918400631147},{"$f":"AO63-$AK63","v":22.364918400631147},{"$f":"AP63-$AK63","v":24.364918400631147}]
[{"$nulls":34},225,{"v":-4.869158230300549,"d":"-4.9"},{"$f":"AJ64*1.4","v":-6.816821522420768},{"$f":"AI64","v":225},12,15,16,17,19,null,225,18.816821522420767,21.816821522420767,22.816821522420767,23.816821522420767,{"$f":"AQ64-$AK64","v":25.816821522420767}]
[{"$nulls":34},275,{"v":-3.9862071702670825,"d":"-4.0"},-5.580690038373915,275,13,16,16,18,20,22,275,18.580690038373916,21.580690038373916,21.580690038373916,23.580690038373916,25.580690038373916,{"$f":"AR65-$AK65","v":27.580690038373916}]
[{"$nulls":34},325,{"v":-3.251169197749153,"d":"-3.3"},-4.551636876848814,325,14,17,17,19,21,23,325,18.551636876848814,21.551636876848814,21.551636876848814,23.551636876848814,25.551636876848814,27.551636876848814]
[{"$nulls":34},375,{"v":-2.621525485730192,"d":"-2.6"},-3.670135680022269,375,15,19,18,20,22,24,375,18.67013568002227,22.67013568002227,21.67013568002227,23.67013568002227,25.67013568002227,27.67013568002227]
[{"$nulls":34},425,{"v":-2.070807656732562,"d":"-2.1"},-2.8991307194255866,425,16,20,19,21,22,24,425,18.899130719425585,22.899130719425585,21.899130719425585,23.899130719425585,24.899130719425585,26.899130719425585]
[{"$nulls":34},475,{"v":-1.581414862247577,"d":"-1.6"},-2.2139808071466076,475,16,21,20,22,23,25,475,18.21398080714661,23.21398080714661,22.21398080714661,24.21398080714661,25.21398080714661,27.21398080714661]
[{"$nulls":34},525,{"v":-1.1410476445968527,"d":"-1.1"},-1.5974667024355937,525,17,22,20,22,24,26,525,18.597466702435593,23.597466702435593,21.597466702435593,23.597466702435593,25.597466702435593,27.597466702435593]
[{"$nulls":34},575,{"v":-0.7407718204916556,"d":"-0.7"},-1.0370805486883177,575,17,23,21,23,24,null,575,18.03708054868832,24.03708054868832,22.03708054868832,24.03708054868832,25.03708054868832]
[{"$nulls":34},625,{"v":-0.37389274115983184,"d":"-0.4"},-0.5234498376237645,625,null,null,21,23,25,null,625,null,null,{"$f":"AO72-$AK72","v":21.523449837623765},{"$f":"AP72-$AK72","v":23.523449837623765},25.523449837623765]
[{"$nulls":44},"Mittelwert P",{"$f":"AVERAGE(AT63:AT72)","v":18.636873477332557},22.636873477332557,21.92553111336168,23.825531113361677,25.432265859220625,27.418840137375465]
[]
[]
[{"$nulls":34},"Mg",null,"Erhaltung",null,500,800,800,1000,1200,1400,null,{"$f":"AM76","v":500},800,800,1000,1200,1400]
[{"$nulls":34},175,{"$f":"IF(Mast_Rasse=3,4.4*LN(AI77)+$V$24*1.06-28.7,0.173+0.01372*AI77+1.47*Mast_LMZ/1000)*$U$5","v":{"v":-5.974941714736534,"d":"-6.0"}},{"$f":"AJ77*1","v":-5.974941714736534},{"$f":"AI77","v":175},4,5,6,6,null,null,{"$f":"AI77","v":175},{"$f":"AM77-$AK77","v":9.974941714736534},{"$f":"AN77-$AK77","v":10.974941714736534},{"$f":"AO77-$AK77","v":11.974941714736534},{"$f":"AP77-$AK77","v":11.974941714736534}]
[{"$nulls":34},225,{"v":-4.869158230300549,"d":"-4.9"},{"$f":"AJ78*1","v":-4.869158230300549},{"$f":"AI78","v":225},5,6,6,7,7,null,225,9.869158230300549,10.869158230300549,10.869158230300549,11.869158230300549,{"$f":"AQ78-$AK78","v":11.869158230300549}]
[{"$nulls":34},275,{"v":-3.9862071702670825,"d":"-4.0"},-3.9862071702670825,275,6,7,7,8,8,8,275,9.986207170267082,10.986207170267082,10.986207170267082,11.986207170267082,11.986207170267082,{"$f":"AR79-$AK79","v":11.986207170267082}]
[{"$nulls":34},325,{"v":-3.251169197749153,"d":"-3.3"},-3.251169197749153,325,7,8,8,8,9,9,325,10.251169197749153,11.251169197749153,11.251169197749153,11.251169197749153,12.251169197749153,12.251169197749153]
[{"$nulls":34},375,{"v":-2.621525485730192,"d":"-2.6"},-2.621525485730192,375,8,8,8,9,9,10,375,10.621525485730192,10.621525485730192,10.621525485730192,11.621525485730192,11.621525485730192,12.621525485730192]
[{"$nulls":34},425,{"v":-2.070807656732562,"d":"-2.1"},-2.070807656732562,425,8,9,9,9,10,10,425,10.070807656732562,11.070807656732562,11.070807656732562,11.070807656732562,12.070807656732562,12.070807656732562]
[{"$nulls":34},475,{"v":-1.581414862247577,"d":"-1.6"},-1.581414862247577,475,9,10,9,10,10,11,475,10.581414862247577,11.581414862247577,10.581414862247577,11.581414862247577,11.581414862247577,12.581414862247577]
[{"$nulls":34},525,{"v":-1.1410476445968527,"d":"-1.1"},-1.1410476445968527,525,9,11,10,10,11,11,525,10.141047644596853,12.141047644596853,11.141047644596853,11.141047644596853,12.141047644596853,12.141047644596853]
[{"$nulls":34},575,{"v":-0.7407718204916556,"d":"-0.7"},-0.7407718204916556,575,9,12,10,11,11,null,575,9.740771820491656,12.740771820491656,10.740771820491656,11.740771820491656,11.740771820491656]
[{"$nulls":34},625,{"v":-0.37389274115983184,"d":"-0.4"},-0.37389274115983184,625,null,null,11,11,11,null,625,null,null,{"$f":"AO86-$AK86","v":11.373892741159832},{"$f":"AP86-$AK86","v":11.373892741159832},11.373892741159832]
[{"$nulls":44},"Mittelwert Mg",{"$f":"AVERAGE(AT77:AT86)","v":10.137449309205795},11.359671531428019,11.061093652401201,11.561093652401201,11.848443867697274,12.275362002887237]
[]
[{"$nulls":34},"Na",null,"Erhaltung",null,500,800,800,1000,1200,1400,null,{"$f":"AM89","v":500},800,800,1000,1200,1400]
[{"$nulls":34},175,{"$f":"IF(Mast_Rasse=3,4.4*LN(AI90)+$V$24*1.06-28.7,0.173+0.01372*AI90+1.47*Mast_LMZ/1000)*$U$5","v":{"v":-5.974941714736534,"d":"-6.0"}},{"$f":"AJ90*0.7","v":-4.182459200315574},{"$f":"AI90","v":175},3,4,4,4,null,null,{"$f":"AI90","v":175},{"$f":"AM90-$AK90","v":7.182459200315574},{"$f":"AN90-$AK90","v":8.182459200315574},{"$f":"AO90-$AK90","v":8.182459200315574},{"$f":"AP90-$AK90","v":8.182459200315574}]
[{"$nulls":34},225,{"v":-4.869158230300549,"d":"-4.9"},{"$f":"AJ91*0.7","v":-3.408410761210384},{"$f":"AI91","v":225},4,4,5,5,5,null,225,7.4084107612103836,7.4084107612103836,8.408410761210384,8.408410761210384,{"$f":"AQ91-$AK91","v":8.408410761210384}]
[{"$nulls":34},275,{"v":-3.9862071702670825,"d":"-4.0"},-2.7903450191869577,275,4,5,5,5,6,6,275,6.790345019186958,7.790345019186958,7.790345019186958,7.790345019186958,8.790345019186958,{"$f":"AR92-$AK92","v":8.790345019186958}]
[{"$nulls":34},325,{"v":-3.251169197749153,"d":"-3.3"},-2.275818438424407,325,5,6,5,6,6,7,325,7.275818438424407,8.275818438424407,7.275818438424407,8.275818438424407,8.275818438424407,9.275818438424407]
[{"$nulls":34},375,{"v":-2.621525485730192,"d":"-2.6"},-1.8350678400111344,375,5,6,6,6,7,7,375,6.835067840011135,7.835067840011135,7.835067840011135,7.835067840011135,8.835067840011135,8.835067840011135]
[{"$nulls":34},425,{"v":-2.070807656732562,"d":"-2.1"},-1.4495653597127933,425,6,7,6,7,7,7,425,7.4495653597127935,8.449565359712793,7.4495653597127935,8.449565359712793,8.449565359712793,8.449565359712793]
[{"$nulls":34},475,{"v":-1.581414862247577,"d":"-1.6"},-1.1069904035733038,475,6,7,7,7,7,8,475,7.106990403573304,8.106990403573304,8.106990403573304,8.106990403573304,8.106990403573304,9.106990403573304]
[{"$nulls":34},525,{"v":-1.1410476445968527,"d":"-1.1"},-0.7987333512177969,525,7,8,7,7,8,8,525,7.7987333512177965,8.798733351217797,7.7987333512177965,7.7987333512177965,8.798733351217797,8.798733351217797]
[{"$nulls":34},575,{"v":-0.7407718204916556,"d":"-0.7"},-0.5185402743441588,575,7,9,7,7,8,null,575,7.518540274344159,9.51854027434416,7.518540274344159,7.518540274344159,8.51854027434416]
[{"$nulls":34},625,{"v":-0.37389274115983184,"d":"-0.4"},-0.26172491881188226,625,null,null,7,8,8,null,625,null,null,{"$f":"AO99-$AK99","v":7.261724918811883},{"$f":"AP99-$AK99","v":8.261724918811883},8.261724918811883]
[{"$nulls":44},"Mittelwert Na",{"$f":"AVERAGE(AT90:AT99)","v":7.262881183110723},8.262881183110723,7.762765556680838,8.062765556680839,8.49391070738809,8.8760867353544]

{"sheet":"Info","index":10,"n_rows":77,"n_cols":7,"rows_kept":77}
["Quellen:"]
[]
["Futterwerte"]
[null,"Bestimmung des Futterwertes von ..., Landwirtschaftskammer Nordrhein-Westfalen, versch. Veröffentlichungen"]
[null,"CVB Veevoedertabel"]
[null,"DLG-Futterwerttabellen Wiederkäuer, 1997"]
[null,"Grundfutterreport Baden-Württemberg 2014, LAZBW Aulendorf, 2015 & ergänzende Auswertungen"]
[null,"LfL-Information: Gruber Tabelle"]
[]
[]
["Bedarfswerte"]
[null,"Empfehlungen zur Energie- und Nährstoffversorgung der Milchkühe und Aufzuchtrinder, GfE, 2001 "]
[null,"Empfehlungen zur Energie- und Nährstoffversorgung der Mastrinder, GfE, 1995 "]
[null,"DLG-Information 1/2006 Schätzung der Futteraufnahme bei der Milchkuh, 2006"]
[null,"Einfluss des Kraftfutterniveaus in der Stiermast auf die Mast- und Schlachtleistung bei Maissilage mit niedriger Energiekonzentration Gruber, L., in: 36. Viehwirtschaftliche Fachtagung 2009,S. 80"]
[]
[]
[]
["Formeln"]
[null,"Lehmann u. Kessler, 1994"]
[null,"Gesamtfutteraufnahme Mastbullen","IT= 0,173+0,01372*LM+1,470*LMZ"]
[null,"DLG, 2006:"]
[null,"Gesamtfutteraufnahme Milchkühe, getrennte Vorlage Standard","IT=0,93*(3,878+Rasse(HF:-2,19;FV:-2,63;BV:-1,83)+Laktationszahl 1:-0,73;+0,22)+LTag(-4,287+4,153*(1-exp(-0,01486*LTag))+LM*(0,0148-0,0000474*LTag+0,0000000904*LTag²)+ML*(0,0825+0,0008098*LTag+0,000000966*LTag²)+KFTM*(0,6962-0,0023289*LTag+0,0000040634*LTag²)+NELgf*0,858)+0,47"]
[null,null,"*KFTM=ECM*0,493-9,25 "]
[]
[null,"Gesamtfutteraufnahme Milchkühe, TMR Standard","IT=0,92*(2,274+Rasse(HF:-1,449;FV:-2,169;BV:-1,391)+Laktationszahl 1:-0,658;+0,236)+LTag*(-5,445+5,298*(1-exp(-0,01838*LTag))+LM*(0,0173-0,0000514*LTag+0,0000000999*LTag²)+ML*(0,2010+0,000808*LTag+0,000001299*LTag²)+KF%*(0,631-0,0002096*LTag+0,0000001213*LTag²)+NELgf*0,609)+0,71"]
[]
[null,"Gesamtfutteraufnahme Schafe","IT=0,9+LM*0,01+(ML-1)*0,4"]
[]
[null,"Gesamtfutteraufnahme Ziege","IT=0,9+LM*0,01+(ML-1)*0,4"]
{"$rows_empty":8}
["Formeln_2"]
[]
[null,"nXP-Mast und Aufzucht"]
[null,"Nettobedarf am Duodenum"]
[null,"MJ/ME"]
[null,"f(x)=a*e^LM)"]
[null,"B_sbt","a",11.8738,null,"Erh. Bedarf LM^0,75*0,53"]
[null,null,"b",2.32E-3]
[null,"B_FV","a",21.156,null,"Erh. Bedarf LM^0,75*0,53"]
[null,null,"b",0.00065]
[null,"F_sbt","a",12.0882,null,"Erh. Bedarf LM^0,75*0,53"]
[null,null,"b",2.48E-3]
[]
[null,"nXP"]
[null,"B_sbt","L_Bedarf","f(x)=a+b*LM+c*LM²*LMZkg"]
[null,null,"a",369,null,"Erh.Bedarf","LM^0,524*16,9"]
[null,null,"b",0.249]
[null,null,"c",-0.0004]
[null,"B_FV","L-Bedarf ","f(x)=a*LM^b"]
[null,null,"a",193.397,null,"Erh.Bedarf","LM^0,524*16,9"]
[null,null,"b",0.1435]
[null,null,"c"]
[null,"F_sbt","L_Bedarf","f(x)=a+b*LM+c*LM²"]
[null,null,"a",263.9,null,"Erh.Bedarf","LM^0,524*16,9"]
[null,null,"b",0.492]
[null,null,"c",-0.00103]
[]
[null,"Mineralstoffe"]
[null,"f(x)=a*LMZ+b"]
[null,"Ca","a",0.0212,null,"Erh. Bedarf 2"]
[null,null,"b",5.8]
[null,"P","a",0.0095,null,"Erh. Bedarf LM^0,75*0,53"]
[null,null,"b",1.3]
[null,"Mg","a",0.0024,null,"Erh. Bedarf LM^0,75*0,53"]
[null,null,"b",0.1]
[]
[]
[null,"Na","a",0.0017,null,"Erh. Bedarf LM^0,75*0,53"]
[null,null,"b",0]

{"sheet":"Einstellungen","index":11,"n_rows":30,"n_cols":6,"rows_kept":30,"merged":[[0,2,0,3]]}
["Grenzwerte",null,"Bearbeiter*in:",null,"E. Gerster"]
[{"$nulls":4},"min","max"]
["Futteraufnahme","DLG 2006, Lehmann u. Kessler, GfE 2001",null,null,{"v":0.9,"d":"90%"},{"v":1.1,"d":"110%"}]
["NEL",{"$nulls":3},{"v":0.95,"d":"95%"},{"v":1.05,"d":"105%"}]
["ME",{"$nulls":3},{"v":0.95,"d":"95%"},{"v":1.05,"d":"105%"}]
["nXP",{"$nulls":3},{"v":0.9,"d":"90%"},{"v":1.1,"d":"110%"}]
["XP",{"$nulls":3},{"v":0.9,"d":"90%"},{"v":1.1,"d":"110%"}]
["RNB","g",null,null,-20,40]
["RNB trocken","g",null,null,-20,0]
["NFC","g/kg TM",{"$nulls":3},400]
["SW","/ kg TM",null,null,1.2]
["ADF","g/kg TM",null,null,200]
["NDF","g/kg TM",null,null,300]
["XS","g/kg TM",{"$nulls":3},350]
["XZ","g/kg TM",{"$nulls":3},100]
["XL","g/kg TM",{"$nulls":3},40]
["XF","g/kg TM",null,null,160]
["sXF","g/kg TM",null,null,100]
[null,null,"je kg \nTM","je kg Milch"]
["Ca","Bedarfsnorm (GfE 1996)",{"v":2,"d":"2.0"},2.5,{"v":0.98,"d":"98%"},{"v":1.5,"d":"150%"}]
["P","% v. Bedarfsnorm (GfE 1996)",1.4,1.4,{"v":1,"d":"100%"},{"v":1.5,"d":"150%"}]
["Na","% v. Bedarfsnorm (GfE 1996)",0.7,0.5,{"v":1,"d":"100%"},{"v":1.5,"d":"150%"}]
["Mg","% v. Bedarfsnorm (GfE 1996)",0.8,0.4,{"v":1,"d":"100%"},{"v":1.5,"d":"150%"}]
["K","% v. Bedarfsnorm (GfE 1996)",1.8,1.4,{"v":1,"d":"100%"},{"v":8,"d":"800%"}]
["Se","% v. Bedarfsnorm (GfE 1996)",0.2,{"v":0,"d":"0.0"},{"v":1,"d":"100%"},{"v":1.5,"d":"150%"}]
["Ca:P",null,null,"1:",0.45,0.8]
["Na:K",null,null,"1:",6.5,13.5]
["DCAB lakt.","meq (Staufenbiel 2007)",null,null,200,350]
["DCAB trocken","meq (Staufenbiel 2007)",{"$nulls":3},0]
["LM-Veränderung","g/Tag",null,null,-1000,500]